null
SMILES: Nc1ccc(Cl)cc1C(=O)OCC(=O)NC1CCS(=O)(=O)C1
InChI Key: InChIKey=YZQBKHSSBPICQR-UHFFFAOYSA-N
Activity Spreadsheet -- Enzyme Inhibition Constant Data from BindingDB
Found 1 hit for monomerid = 100077
Trg + Lig
Ki
nM
ΔG°
kcal/mole
IC50
nM
Kd
nM
EC50/IC50
nM
koff
s-1
kon
M-1s-1
pHTemp
°C
Kallikrein-7
(Homo sapiens (Human))
BDBM100077
(2-amino-5-chloro-benzoic acid [2-[(1,1-diketothiol...)
Show SMILES Nc1ccc(Cl)cc1C(=O)OCC(=O)NC1CCS(=O)(=O)C1
Show InChI InChI=1S/C13H15ClN2O5S/c14-8-1-2-11(15)10(5-8)13(18)21-6-12(17)16-9-3-4-22(19,20)7-9/h1-2,5,9H,3-4,6-7,15H2,(H,16,17)
Reactome pathway
PCBioAssay
n/an/an/an/a>7.72E+3n/an/an/an/a
The Scripps Research Institute Molecular Screening Center
Curated by PubChem BioAssay
PubChem Bioassay (2013)
BindingDB Entry DOI: 10.7270/Q29G5KF0