BDBM100555 US8501732, I-115
SMILES: COC(=O)c1c(CNC(=O)c2ccc(cc2)S(N)(=O)=O)c(=O)c2ccc(Cl)cc2n1-c1ccccc1
InChI Key: InChIKey=KDRBHCBJKKMCCP-UHFFFAOYSA-N
Data: 1 IC50
Activity Spreadsheet -- Enzyme Inhibition Constant Data from BindingDB
Found 1 hit for monomerid = 100555
Trg + Lig
Ki
nM
ΔG°
kcal/mole
IC50
nM
Kd
nM
EC50/IC50
nM
koff
s-1
kon
M-1s-1
pHTemp
°C
Mitogen-activated protein kinase 8
(Homo sapiens (Human))
BDBM100555
(US8501732, I-115)
Show SMILES COC(=O)c1c(CNC(=O)c2ccc(cc2)S(N)(=O)=O)c(=O)c2ccc(Cl)cc2n1-c1ccccc1
Show InChI InChI=1S/C25H20ClN3O6S/c1-35-25(32)22-20(14-28-24(31)15-7-10-18(11-8-15)36(27,33)34)23(30)19-12-9-16(26)13-21(19)29(22)17-5-3-2-4-6-17/h2-13H,14H2,1H3,(H,28,31)(H2,27,33,34)
NCI pathway
Reactome pathway
US Patent
n/an/a 8n/an/an/an/an/an/a
Hoffmann-La Roche Inc.
US Patent
Assay Description
In vitro JNK1 assay.
US Patent US8501732 (2013)
BindingDB Entry DOI: 10.7270/Q2RF5SP9