BDBM100572 US8501732, I-132
SMILES: COC(=O)c1c(CNC(=O)c2ccc(Cl)cc2)c(=O)c2ccc(Cl)cc2n1-c1ccccc1
InChI Key: InChIKey=POYGBPZFOSSLMK-UHFFFAOYSA-N
Data: 1 IC50
Activity Spreadsheet -- Enzyme Inhibition Constant Data from BindingDB
Found 1 hit for monomerid = 100572
Trg + Lig
Ki
nM
ΔG°
kcal/mole
IC50
nM
Kd
nM
EC50/IC50
nM
koff
s-1
kon
M-1s-1
pHTemp
°C
Mitogen-activated protein kinase 8
(Homo sapiens (Human))
BDBM100572
(US8501732, I-132)
Show SMILES COC(=O)c1c(CNC(=O)c2ccc(Cl)cc2)c(=O)c2ccc(Cl)cc2n1-c1ccccc1
Show InChI InChI=1S/C25H18Cl2N2O4/c1-33-25(32)22-20(14-28-24(31)15-7-9-16(26)10-8-15)23(30)19-12-11-17(27)13-21(19)29(22)18-5-3-2-4-6-18/h2-13H,14H2,1H3,(H,28,31)
NCI pathway
Reactome pathway
US Patent
n/an/a 15n/an/an/an/an/an/a
Hoffmann-La Roche Inc.
US Patent
Assay Description
In vitro JNK1 assay.
US Patent US8501732 (2013)
BindingDB Entry DOI: 10.7270/Q2RF5SP9