BDBM100574 US8501732, I-134
SMILES: COC(=O)c1c(CNC(=O)c2ccc(OC)cc2)c(=O)c2ccc(Cl)cc2n1-c1ccccc1
InChI Key: InChIKey=QYSUWHDPYQRRHK-UHFFFAOYSA-N
Data: 1 IC50
Activity Spreadsheet -- Enzyme Inhibition Constant Data from BindingDB
Found 1 hit for monomerid = 100574
Trg + Lig
Ki
nM
ΔG°
kcal/mole
IC50
nM
Kd
nM
EC50/IC50
nM
koff
s-1
kon
M-1s-1
pHTemp
°C
Mitogen-activated protein kinase 8
(Homo sapiens (Human))
BDBM100574
(US8501732, I-134)
Show SMILES COC(=O)c1c(CNC(=O)c2ccc(OC)cc2)c(=O)c2ccc(Cl)cc2n1-c1ccccc1
Show InChI InChI=1S/C26H21ClN2O5/c1-33-19-11-8-16(9-12-19)25(31)28-15-21-23(26(32)34-2)29(18-6-4-3-5-7-18)22-14-17(27)10-13-20(22)24(21)30/h3-14H,15H2,1-2H3,(H,28,31)
NCI pathway
Reactome pathway
US Patent
n/an/a 7n/an/an/an/an/an/a
Hoffmann-La Roche Inc.
US Patent
Assay Description
In vitro JNK1 assay.
US Patent US8501732 (2013)
BindingDB Entry DOI: 10.7270/Q2RF5SP9