BDBM100590 US8501732, I-150
SMILES: COC(=O)c1c(CNC(=O)c2ccccc2)c(=O)c2ccc(Cl)cc2n1-c1ccccc1
InChI Key: InChIKey=GOBZKIYERQHRRE-UHFFFAOYSA-N
Data: 1 IC50
Activity Spreadsheet -- Enzyme Inhibition Constant Data from BindingDB
Found 1 hit for monomerid = 100590
Trg + Lig
Ki
nM
ΔG°
kcal/mole
IC50
nM
Kd
nM
EC50/IC50
nM
koff
s-1
kon
M-1s-1
pHTemp
°C
Mitogen-activated protein kinase 8
(Homo sapiens (Human))
BDBM100590
(US8501732, I-150)
Show SMILES COC(=O)c1c(CNC(=O)c2ccccc2)c(=O)c2ccc(Cl)cc2n1-c1ccccc1
Show InChI InChI=1S/C25H19ClN2O4/c1-32-25(31)22-20(15-27-24(30)16-8-4-2-5-9-16)23(29)19-13-12-17(26)14-21(19)28(22)18-10-6-3-7-11-18/h2-14H,15H2,1H3,(H,27,30)
NCI pathway
Reactome pathway
US Patent
n/an/a 12n/an/an/an/an/an/a
Hoffmann-La Roche Inc.
US Patent
Assay Description
In vitro JNK1 assay.
US Patent US8501732 (2013)
BindingDB Entry DOI: 10.7270/Q2RF5SP9