BDBM100793 US8507533, 86
SMILES: CCCC(Oc1ccc(nc1)-n1cc(cn1)C(F)(F)F)c1ccc(cc1)C(=O)NCCC(O)=O
InChI Key: InChIKey=WABICJZHMMDLSC-UHFFFAOYSA-N
Data: 2 KI
Activity Spreadsheet -- Enzyme Inhibition Constant Data from BindingDB
Found 2 hits for monomerid = 100793
Trg + Lig
Ki
nM
ΔG°
kcal/mole
IC50
nM
Kd
nM
EC50/IC50
nM
koff
s-1
kon
M-1s-1
pHTemp
°C
Glucagon receptor
(Homo sapiens (Human))
BDBM100793
(US8507533, 86)
Show SMILES CCCC(Oc1ccc(nc1)-n1cc(cn1)C(F)(F)F)c1ccc(cc1)C(=O)NCCC(O)=O
Show InChI InChI=1S/C23H23F3N4O4/c1-2-3-19(15-4-6-16(7-5-15)22(33)27-11-10-21(31)32)34-18-8-9-20(28-13-18)30-14-17(12-29-30)23(24,25)26/h4-9,12-14,19H,2-3,10-11H2,1H3,(H,27,33)(H,31,32)
230n/an/an/an/an/an/an/an/a
Pfizer Inc.
Curated by ChEMBL
Assay Description
Displacement of [125I]-glucagon-cex from human glucagon receptor by cell based assay in presence of 0.2% bovine serum albumin
Bioorg Med Chem Lett 23: 3051-8 (2013)
Article DOI: 10.1016/j.bmcl.2013.03.014
BindingDB Entry DOI: 10.7270/Q27M099R
Glucagon
(Homo sapiens (Human))
BDBM100793
(US8507533, 86)
Show SMILES CCCC(Oc1ccc(nc1)-n1cc(cn1)C(F)(F)F)c1ccc(cc1)C(=O)NCCC(O)=O
Show InChI InChI=1S/C23H23F3N4O4/c1-2-3-19(15-4-6-16(7-5-15)22(33)27-11-10-21(31)32)34-18-8-9-20(28-13-18)30-14-17(12-29-30)23(24,25)26/h4-9,12-14,19H,2-3,10-11H2,1H3,(H,27,33)(H,31,32)
Reactome pathway
US Patent
233n/an/an/an/an/an/a7.4n/a
Pfizer Inc.
US Patent
Assay Description
The Glucagon SPA assay is used to determine the ability of test compounds to block the binding of glucagon-cex to the glucagon receptors.
US Patent US8507533 (2013)
BindingDB Entry DOI: 10.7270/Q23R0RGH