BDBM100830 US8507533, 141
SMILES: CCCC(Oc1cc(C)c(c(C)c1)-n1cnc(c1)C(F)(F)F)c1ccc(cc1)C(=O)NCCC(O)=O
InChI Key: InChIKey=GZIUADRPSVKWDX-UHFFFAOYSA-N
Data: 1 KI
Activity Spreadsheet -- Enzyme Inhibition Constant Data from BindingDB
Found 1 hit for monomerid = 100830
Trg + Lig
Ki
nM
ΔG°
kcal/mole
IC50
nM
Kd
nM
EC50/IC50
nM
koff
s-1
kon
M-1s-1
pHTemp
°C
Glucagon
(Homo sapiens (Human))
BDBM100830
(US8507533, 141)
Show SMILES CCCC(Oc1cc(C)c(c(C)c1)-n1cnc(c1)C(F)(F)F)c1ccc(cc1)C(=O)NCCC(O)=O
Show InChI InChI=1S/C26H28F3N3O4/c1-4-5-21(18-6-8-19(9-7-18)25(35)30-11-10-23(33)34)36-20-12-16(2)24(17(3)13-20)32-14-22(31-15-32)26(27,28)29/h6-9,12-15,21H,4-5,10-11H2,1-3H3,(H,30,35)(H,33,34)
Reactome pathway
US Patent
89.5n/an/an/an/an/an/a7.4n/a
Pfizer Inc.
US Patent
Assay Description
The Glucagon SPA assay is used to determine the ability of test compounds to block the binding of glucagon-cex to the glucagon receptors.
US Patent US8507533 (2013)
BindingDB Entry DOI: 10.7270/Q23R0RGH