BDBM100852 US8507533, 170::US8507533, 419
SMILES: Cc1cc(cc(C)c1-n1cc(cn1)C(F)(F)F)C(Nc1ccc(cn1)C(=O)NCCC(O)=O)C1CCCC1
InChI Key: InChIKey=CCMSZNRJWBLATB-UHFFFAOYSA-N
Data: 2 KI
Activity Spreadsheet -- Enzyme Inhibition Constant Data from BindingDB
Found 2 hits for monomerid = 100852
Trg + Lig
Ki
nM
ΔG°
kcal/mole
IC50
nM
Kd
nM
EC50/IC50
nM
koff
s-1
kon
M-1s-1
pHTemp
°C
Glucagon
(Homo sapiens (Human))
BDBM100852
(US8507533, 170 | US8507533, 419)
Show SMILES Cc1cc(cc(C)c1-n1cc(cn1)C(F)(F)F)C(Nc1ccc(cn1)C(=O)NCCC(O)=O)C1CCCC1
Show InChI InChI=1S/C27H30F3N5O3/c1-16-11-20(12-17(2)25(16)35-15-21(14-33-35)27(28,29)30)24(18-5-3-4-6-18)34-22-8-7-19(13-32-22)26(38)31-10-9-23(36)37/h7-8,11-15,18,24H,3-6,9-10H2,1-2H3,(H,31,38)(H,32,34)(H,36,37)
Reactome pathway
US Patent
28n/an/an/an/an/an/a7.4n/a
Pfizer Inc.
US Patent
Assay Description
The Glucagon SPA assay is used to determine the ability of test compounds to block the binding of glucagon-cex to the glucagon receptors.
US Patent US8507533 (2013)
BindingDB Entry DOI: 10.7270/Q23R0RGH
Glucagon
(Homo sapiens (Human))
BDBM100852
(US8507533, 170 | US8507533, 419)
Show SMILES Cc1cc(cc(C)c1-n1cc(cn1)C(F)(F)F)C(Nc1ccc(cn1)C(=O)NCCC(O)=O)C1CCCC1
Show InChI InChI=1S/C27H30F3N5O3/c1-16-11-20(12-17(2)25(16)35-15-21(14-33-35)27(28,29)30)24(18-5-3-4-6-18)34-22-8-7-19(13-32-22)26(38)31-10-9-23(36)37/h7-8,11-15,18,24H,3-6,9-10H2,1-2H3,(H,31,38)(H,32,34)(H,36,37)
Reactome pathway
US Patent
224n/an/an/an/an/an/a7.4n/a
Pfizer Inc.
US Patent
Assay Description
The Glucagon SPA assay is used to determine the ability of test compounds to block the binding of glucagon-cex to the glucagon receptors.
US Patent US8507533 (2013)
BindingDB Entry DOI: 10.7270/Q23R0RGH