BDBM10088 (3Z)-4-{[(1S,3S)-3-aminocyclopentyl]amino}-3-[(3-methoxy-1H-pyrrol-2-yl)methylidene]-5-nitro-2,3-dihydro-1H-indol-2-one::(Z)-4-(3-Amino-cyclopentylamino)-3-(3-methoxy-1H-pyrrol-2-ylmethylene)-5-nitro-1,3-dihydro-indol-2-one::C-4 substituted oxindole inhibitor 7l
SMILES: COc1cc[nH]c1\C=C1/C(=O)Nc2ccc(c(N[C@H]3CC[C@H](N)C3)c12)N(=O)=O
InChI Key: InChIKey=KPJBSRJVJCKOEP-IPPYBGAYSA-N
Data: 1 IC50
Activity Spreadsheet -- Enzyme Inhibition Constant Data from BindingDB
Found 1 hit for monomerid = 10088
Trg + Lig
Ki
nM
ΔG°
kcal/mole
IC50
nM
Kd
nM
EC50/IC50
nM
koff
s-1
kon
M-1s-1
pHTemp
°C
CDK2/CycE
(Homo sapiens (Human))
BDBM10088
((3Z)-4-{[(1S,3S)-3-aminocyclopentyl]amino}-3-[(3-m...)
Show SMILES COc1cc[nH]c1\C=C1/C(=O)Nc2ccc(c(N[C@H]3CC[C@H](N)C3)c12)N(=O)=O |r|
Show InChI InChI=1S/C19H21N5O4/c1-28-16-6-7-21-14(16)9-12-17-13(23-19(12)25)4-5-15(24(26)27)18(17)22-11-3-2-10(20)8-11/h4-7,9-11,21-22H,2-3,8,20H2,1H3,(H,23,25)/b12-9-/t10-,11-/m0/s1
n/an/a 5n/an/an/an/a7.522
Hoffmann-La Roche Inc.
Assay Description
Kinase assays were performed using a recombinant human cyclin E-CDK2 complex. The enzyme was assayed with substrate in the presence of 1uM ATP/[gamma...
Bioorg Med Chem 11: 1873-81 (2003)
Article DOI: 10.1016/s0968-0896(03)00036-1
BindingDB Entry DOI: 10.7270/Q24M92SM