null
SMILES: COc1cc[nH]c1\C=C1/C(=O)Nc2ccc(F)c(C#C[C@@H]3C[C@@H](O)CN3)c12
InChI Key: InChIKey=AWZLLTSFYOFJHT-QNWYCTJYSA-N
PDB links: 1 PDB ID contains inhibitors having a similarity of 90% to this monomer.
Activity Spreadsheet -- Enzyme Inhibition Constant Data from BindingDB
Found 1 hit for monomerid = 10113
Trg + Lig
Ki
nM
ΔG°
kcal/mole
IC50
nM
Kd
nM
EC50/IC50
nM
koff
s-1
kon
M-1s-1
pHTemp
°C
Cyclin-dependent kinase 2/G1/S-specific cyclin-E1
(Homo sapiens (Human))
BDBM10113
((3Z)-5-fluoro-4-{2-[(2S,4R)-4-hydroxypyrrolidin-2-...)
Show SMILES COc1cc[nH]c1\C=C1/C(=O)Nc2ccc(F)c(C#C[C@@H]3C[C@@H](O)CN3)c12 |r|
Show InChI InChI=1S/C20H18FN3O3/c1-27-18-6-7-22-17(18)9-14-19-13(3-2-11-8-12(25)10-23-11)15(21)4-5-16(19)24-20(14)26/h4-7,9,11-12,22-23,25H,8,10H2,1H3,(H,24,26)/b14-9-/t11-,12-/m1/s1
n/an/a 4n/an/an/an/a7.522
Hoffmann-La Roche Inc.
Assay Description
Kinase assays were performed using a recombinant human cyclin E-CDK2 complex. The enzyme was assayed with substrate in the presence of 1uM ATP/[gamma...
Bioorg Med Chem Lett 14: 913-7 (2004)
Article DOI: 10.1016/j.bmcl.2003.12.009
BindingDB Entry DOI: 10.7270/Q20V8B1V