BDBM101240 US8524722, 123
SMILES: CC(C)C(C)C\C=C\C(=O)N1CCc2c(C1)sc1ncnc(Nc3cc(O)cc(Cl)c3)c21
InChI Key: InChIKey=FHNHKAFWHQJIDM-GQCTYLIASA-N
Data: 1 IC50
Activity Spreadsheet -- Enzyme Inhibition Constant Data from BindingDB
Found 1 hit for monomerid = 101240
Trg + Lig
Ki
nM
ΔG°
kcal/mole
IC50
nM
Kd
nM
EC50/IC50
nM
koff
s-1
kon
M-1s-1
pHTemp
°C
Epidermal growth factor receptor
(Homo sapiens (Human))
BDBM101240
(US8524722, 123)
Show SMILES CC(C)C(C)C\C=C\C(=O)N1CCc2c(C1)sc1ncnc(Nc3cc(O)cc(Cl)c3)c21
Show InChI InChI=1S/C24H27ClN4O2S/c1-14(2)15(3)5-4-6-21(31)29-8-7-19-20(12-29)32-24-22(19)23(26-13-27-24)28-17-9-16(25)10-18(30)11-17/h4,6,9-11,13-15,30H,5,7-8,12H2,1-3H3,(H,26,27,28)/b6-4+
US Patent
n/an/a 1n/an/an/an/a7.022
Bayer Intellectual Property GmbH
US Patent
Assay Description
EGFR inhibitory activity of compounds of the present invention is quantified employing the EGFR HTRF assay.
US Patent US8524722 (2013)
BindingDB Entry DOI: 10.7270/Q2B856RQ