BDBM10155 (2S)-N-[(5R)-5-[(4-aminobenzene)(2-methylpropyl)sulfonamido]-6-hydroxyhexyl]-2-(cyclopropylformamido)-3,3-diphenylpropanamide::lysine sulfonamide analogue 16
SMILES: CC(C)CN(C(CO)CCCCNC(=O)[C@@H](NC(=O)C1CC1)C(c1ccccc1)c1ccccc1)S(=O)(=O)c1ccc(N)cc1
InChI Key: InChIKey=IDZLZILNJRBKDA-OQGPVULJSA-N
Data: 1 KI  1 IC50
Activity Spreadsheet -- Enzyme Inhibition Constant Data from BindingDB
Found 1 hit for monomerid = 10155
Trg + Lig
Ki
nM
ΔG°
kcal/mole
IC50
nM
Kd
nM
EC50/IC50
nM
koff
s-1
kon
M-1s-1
pHTemp
°C
HIV-1 Protease
(Human immunodeficiency virus type 1)
BDBM10155
((2S)-N-[(5R)-5-[(4-aminobenzene)(2-methylpropyl)su...)
Show SMILES CC(C)CN(C(CO)CCCCNC(=O)[C@@H](NC(=O)C1CC1)C(c1ccccc1)c1ccccc1)S(=O)(=O)c1ccc(N)cc1 |r|
Show InChI InChI=1S/C35H46N4O5S/c1-25(2)23-39(45(43,44)31-20-18-29(36)19-21-31)30(24-40)15-9-10-22-37-35(42)33(38-34(41)28-16-17-28)32(26-11-5-3-6-12-26)27-13-7-4-8-14-27/h3-8,11-14,18-21,25,28,30,32-33,40H,9-10,15-17,22-24,36H2,1-2H3,(H,37,42)(H,38,41)/t30?,33-/m0/s1
0.450n/a 0.430n/an/an/an/an/an/a
Ambrilia Biopharma Inc.
Assay Description
HIV-1 protease activity was measured by a continuous fluorometric assay. The proteolytic activity can be monitored by the increase in fluorescence in...
Bioorg Med Chem Lett 16: 3459-62 (2006)
Article DOI: 10.1016/j.bmcl.2006.04.011
BindingDB Entry DOI: 10.7270/Q2RB72T4