BDBM10159 (2S)-N-[(5R)-5-[(4-aminobenzene)(2-methylpropyl)sulfonamido]-6-hydroxyhexyl]-2-(morpholin-4-ylcarbonylamino)-3,3-diphenylpropanamide::lysine sulfonamide analogue 20
SMILES: CC(C)CN(C(CO)CCCCNC(=O)[C@@H](NC(=O)N1CCOCC1)C(c1ccccc1)c1ccccc1)S(=O)(=O)c1ccc(N)cc1
InChI Key: InChIKey=ZRVQPJBFUVAVQF-AEHIRBQFSA-N
Data: 1 KI  1 IC50
Activity Spreadsheet -- Enzyme Inhibition Constant Data from BindingDB
Found 1 hit for monomerid = 10159
Trg + Lig
Ki
nM
ΔG°
kcal/mole
IC50
nM
Kd
nM
EC50/IC50
nM
koff
s-1
kon
M-1s-1
pHTemp
°C
HIV-1 Protease
(Human immunodeficiency virus type 1)
BDBM10159
((2S)-N-[(5R)-5-[(4-aminobenzene)(2-methylpropyl)su...)
Show SMILES CC(C)CN(C(CO)CCCCNC(=O)[C@@H](NC(=O)N1CCOCC1)C(c1ccccc1)c1ccccc1)S(=O)(=O)c1ccc(N)cc1 |r|
Show InChI InChI=1S/C36H49N5O6S/c1-27(2)25-41(48(45,46)32-18-16-30(37)17-19-32)31(26-42)15-9-10-20-38-35(43)34(39-36(44)40-21-23-47-24-22-40)33(28-11-5-3-6-12-28)29-13-7-4-8-14-29/h3-8,11-14,16-19,27,31,33-34,42H,9-10,15,20-26,37H2,1-2H3,(H,38,43)(H,39,44)/t31?,34-/m0/s1
0.550n/a 0.510n/an/an/an/an/an/a
Ambrilia Biopharma Inc.
Assay Description
HIV-1 protease activity was measured by a continuous fluorometric assay. The proteolytic activity can be monitored by the increase in fluorescence in...
Bioorg Med Chem Lett 16: 3459-62 (2006)
Article DOI: 10.1016/j.bmcl.2006.04.011
BindingDB Entry DOI: 10.7270/Q2RB72T4