BDBM10163 (2S)-N-[(5R)-5-[(4-aminobenzene)(2-methylpropyl)sulfonamido]-6-hydroxyhexyl]-3,3-diphenyl-2-(pyridin-3-ylformamido)propanamide::lysine sulfonamide analogue 24
SMILES: CC(C)CN(C(CO)CCCCNC(=O)[C@@H](NC(=O)c1cccnc1)C(c1ccccc1)c1ccccc1)S(=O)(=O)c1ccc(N)cc1
InChI Key: InChIKey=ATZYNQDVPDSIJF-JXTSYGIPSA-N
Data: 1 KI  1 IC50
Activity Spreadsheet -- Enzyme Inhibition Constant Data from BindingDB
Found 1 hit for monomerid = 10163
Trg + Lig
Ki
nM
ΔG°
kcal/mole
IC50
nM
Kd
nM
EC50/IC50
nM
koff
s-1
kon
M-1s-1
pHTemp
°C
HIV-1 Protease
(Human immunodeficiency virus type 1)
BDBM10163
((2S)-N-[(5R)-5-[(4-aminobenzene)(2-methylpropyl)su...)
Show SMILES CC(C)CN(C(CO)CCCCNC(=O)[C@@H](NC(=O)c1cccnc1)C(c1ccccc1)c1ccccc1)S(=O)(=O)c1ccc(N)cc1 |r|
Show InChI InChI=1S/C37H45N5O5S/c1-27(2)25-42(48(46,47)33-20-18-31(38)19-21-33)32(26-43)17-9-10-23-40-37(45)35(41-36(44)30-16-11-22-39-24-30)34(28-12-5-3-6-13-28)29-14-7-4-8-15-29/h3-8,11-16,18-22,24,27,32,34-35,43H,9-10,17,23,25-26,38H2,1-2H3,(H,40,45)(H,41,44)/t32?,35-/m0/s1
0.550n/a 0.680n/an/an/an/an/an/a
Ambrilia Biopharma Inc.
Assay Description
HIV-1 protease activity was measured by a continuous fluorometric assay. The proteolytic activity can be monitored by the increase in fluorescence in...
Bioorg Med Chem Lett 16: 3459-62 (2006)
Article DOI: 10.1016/j.bmcl.2006.04.011
BindingDB Entry DOI: 10.7270/Q2RB72T4