BDBM10168 (2S)-N-[(5R)-5-[(4-aminobenzene)(2-methylpropyl)sulfonamido]-6-hydroxyhexyl]-2-[(6-aminopyridin-3-yl)formamido]-3,3-diphenylpropanamide::lysine sulfonamide analogue 29
SMILES: CC(C)CN(C(CO)CCCCNC(=O)[C@@H](NC(=O)c1ccc(N)nc1)C(c1ccccc1)c1ccccc1)S(=O)(=O)c1ccc(N)cc1
InChI Key: InChIKey=GAFQOKJGGGHJRM-IKAUJVHPSA-N
Data: 1 KI  1 IC50
Activity Spreadsheet -- Enzyme Inhibition Constant Data from BindingDB
Found 1 hit for monomerid = 10168
Trg + Lig
Ki
nM
ΔG°
kcal/mole
IC50
nM
Kd
nM
EC50/IC50
nM
koff
s-1
kon
M-1s-1
pHTemp
°C
HIV-1 Protease
(Human immunodeficiency virus type 1)
BDBM10168
((2S)-N-[(5R)-5-[(4-aminobenzene)(2-methylpropyl)su...)
Show SMILES CC(C)CN(C(CO)CCCCNC(=O)[C@@H](NC(=O)c1ccc(N)nc1)C(c1ccccc1)c1ccccc1)S(=O)(=O)c1ccc(N)cc1 |r|
Show InChI InChI=1S/C37H46N6O5S/c1-26(2)24-43(49(47,48)32-19-17-30(38)18-20-32)31(25-44)15-9-10-22-40-37(46)35(42-36(45)29-16-21-33(39)41-23-29)34(27-11-5-3-6-12-27)28-13-7-4-8-14-28/h3-8,11-14,16-21,23,26,31,34-35,44H,9-10,15,22,24-25,38H2,1-2H3,(H2,39,41)(H,40,46)(H,42,45)/t31?,35-/m0/s1
0.5n/a 0.400n/an/an/an/an/an/a
Ambrilia Biopharma Inc.
Assay Description
HIV-1 protease activity was measured by a continuous fluorometric assay. The proteolytic activity can be monitored by the increase in fluorescence in...
Bioorg Med Chem Lett 16: 3459-62 (2006)
Article DOI: 10.1016/j.bmcl.2006.04.011
BindingDB Entry DOI: 10.7270/Q2RB72T4