BDBM101724 US8530504, 87
SMILES: CCCN(c1c(OC)nn2c(csc12)-c1c(OC)cc(COC)cc1OC)c1cccnc1
InChI Key: InChIKey=IDARXAKMUUBNRH-UHFFFAOYSA-N
Data: 1 IC50
Activity Spreadsheet -- Enzyme Inhibition Constant Data from BindingDB
Found 1 hit for monomerid = 101724
Trg + Lig
Ki
nM
ΔG°
kcal/mole
IC50
nM
Kd
nM
EC50/IC50
nM
koff
s-1
kon
M-1s-1
pHTemp
°C
Corticotropin releasing factor receptor 1
(Homo sapiens (Human))
BDBM101724
(US8530504, 87)
Show SMILES CCCN(c1c(OC)nn2c(csc12)-c1c(OC)cc(COC)cc1OC)c1cccnc1 |(-5.58,5.96,;-4.09,5.56,;-3.7,4.08,;-2.21,3.68,;-1.81,2.19,;-2.72,.94,;-4.26,.94,;-5.03,-.39,;-1.81,-.3,;-.35,.17,;1.12,-.3,;2.02,.94,;1.12,2.19,;-.35,1.71,;1.52,-1.79,;.43,-2.88,;-1.06,-2.48,;-2.15,-3.57,;.83,-4.37,;2.32,-4.77,;2.71,-6.25,;1.62,-7.34,;.14,-6.94,;3.4,-3.68,;3.01,-2.19,;4.09,-1.1,;5.58,-1.5,;-1.12,4.77,;-1.52,6.25,;-.43,7.34,;1.06,6.94,;1.46,5.46,;.37,4.37,)|
Show InChI InChI=1S/C24H28N4O4S/c1-6-10-27(17-8-7-9-25-13-17)22-23(32-5)26-28-18(15-33-24(22)28)21-19(30-3)11-16(14-29-2)12-20(21)31-4/h7-9,11-13,15H,6,10,14H2,1-5H3
Reactome pathway
US Patent
n/an/a 36n/an/an/an/an/an/a
Eisai R&D Management Co., Ltd.
US Patent
Assay Description
A binding competition experiment with CRF was conducted by the SPA (GE Healthcare) method using a 96-well plate.
US Patent US8530504 (2013)
BindingDB Entry DOI: 10.7270/Q29885NS