BDBM101933 US8530460, 1.13
SMILES: CCCOc1ccc(cc1)N1CC(C1)Oc1ccc(cc1)[C@H](C)NC(C)=O
InChI Key: InChIKey=JUGKVPLFJCZLQF-INIZCTEOSA-N
Data: 1 IC50
Activity Spreadsheet -- Enzyme Inhibition Constant Data from BindingDB
Found 1 hit for monomerid = 101933
Trg + Lig
Ki
nM
ΔG°
kcal/mole
IC50
nM
Kd
nM
EC50/IC50
nM
koff
s-1
kon
M-1s-1
pHTemp
°C
Acetyl-CoA carboxylase 2 (ACC2.v2)
(Homo sapiens (Human))
BDBM101933
(US8530460, 1.13)
Show SMILES CCCOc1ccc(cc1)N1CC(C1)Oc1ccc(cc1)[C@H](C)NC(C)=O |r|
Show InChI InChI=1S/C22H28N2O3/c1-4-13-26-20-11-7-19(8-12-20)24-14-22(15-24)27-21-9-5-18(6-10-21)16(2)23-17(3)25/h5-12,16,22H,4,13-15H2,1-3H3,(H,23,25)/t16-/m0/s1
US Patent
n/an/a 70n/an/an/an/an/an/a
Boehringer Ingelheim International GmbH
US Patent
Assay Description
Enzyme assay using human acetyl-CoA carboxylase 2 (ACC).
US Patent US8530460 (2013)
BindingDB Entry DOI: 10.7270/Q2X34W3N