BDBM10217 2-(2,3-dihydro-1,4-benzodioxin-2-yl)-N-(furan-2-ylmethyl)-1,3-thiazole-4-carboxamide::BI-9C8::Burnham Institute Compound 3
SMILES: O=C(NCc1ccco1)c1csc(n1)C1COc2ccccc2O1
InChI Key: InChIKey=HBFIGRZWORPLGB-UHFFFAOYSA-N
Data: 3 IC50
Activity Spreadsheet -- Enzyme Inhibition Constant Data from BindingDB
Found 3 hits for monomerid = 10217
Trg + Lig
Ki
nM
ΔG°
kcal/mole
IC50
nM
Kd
nM
EC50/IC50
nM
koff
s-1
kon
M-1s-1
pHTemp
°C
Caspase-3
(Homo sapiens (Human))
BDBM10217
(2-(2,3-dihydro-1,4-benzodioxin-2-yl)-N-(furan-2-yl...)
Show SMILES O=C(NCc1ccco1)c1csc(n1)C1COc2ccccc2O1
Show InChI InChI=1S/C17H14N2O4S/c20-16(18-8-11-4-3-7-21-11)12-10-24-17(19-12)15-9-22-13-5-1-2-6-14(13)23-15/h1-7,10,15H,8-9H2,(H,18,20)
NCI pathway
Reactome pathway
n/an/a 1.33E+5n/an/an/an/a7.522
Burnham Institute
Assay Description
Fluorescent assays were carried out in black 96-well plates. Caspase activity was monitored using a Labsystem Fluoroskan II spectrofluorometer with a...
J Med Chem 48: 1649-56 (2005)
Article DOI: 10.1021/jm0493212
BindingDB Entry DOI: 10.7270/Q2GT5KDJ
Caspase-8
(Homo sapiens (Human))
BDBM10217
(2-(2,3-dihydro-1,4-benzodioxin-2-yl)-N-(furan-2-yl...)
Show SMILES O=C(NCc1ccco1)c1csc(n1)C1COc2ccccc2O1
Show InChI InChI=1S/C17H14N2O4S/c20-16(18-8-11-4-3-7-21-11)12-10-24-17(19-12)15-9-22-13-5-1-2-6-14(13)23-15/h1-7,10,15H,8-9H2,(H,18,20)
NCI pathway
Reactome pathway
n/an/a 6.00E+4n/an/an/an/an/an/a
Burnham Institute
Assay Description
Fluorescent assays were carried out in black 96-well plates. Caspase activity was monitored using a Labsystem Fluoroskan II spectrofluorometer with a...
J Med Chem 48: 1649-56 (2005)
Article DOI: 10.1021/jm0493212
BindingDB Entry DOI: 10.7270/Q2GT5KDJ
Caspase-7
(Homo sapiens (Human))
BDBM10217
(2-(2,3-dihydro-1,4-benzodioxin-2-yl)-N-(furan-2-yl...)
Show SMILES O=C(NCc1ccco1)c1csc(n1)C1COc2ccccc2O1
Show InChI InChI=1S/C17H14N2O4S/c20-16(18-8-11-4-3-7-21-11)12-10-24-17(19-12)15-9-22-13-5-1-2-6-14(13)23-15/h1-7,10,15H,8-9H2,(H,18,20)
NCI pathway
Reactome pathway
n/an/a>2.00E+5n/an/an/an/an/an/a
Burnham Institute
Assay Description
Fluorescent assays were carried out in black 96-well plates. Caspase activity was monitored using a Labsystem Fluoroskan II spectrofluorometer with a...
J Med Chem 48: 1649-56 (2005)
Article DOI: 10.1021/jm0493212
BindingDB Entry DOI: 10.7270/Q2GT5KDJ