null
SMILES: CN(C)C(=O)c1csc(n1)C1COc2ccccc2O1
InChI Key: InChIKey=VSVNXLFCAZVTOC-UHFFFAOYSA-N
Activity Spreadsheet -- Enzyme Inhibition Constant Data from BindingDB
Found 3 hits for monomerid = 10221
Trg + Lig
Ki
nM
ΔG°
kcal/mole
IC50
nM
Kd
nM
EC50/IC50
nM
koff
s-1
kon
M-1s-1
pHTemp
°C
Caspase-3
(Homo sapiens (Human))
BDBM10221
(2-(2,3-dihydro-1,4-benzodioxin-2-yl)-N,N-dimethyl-...)
Show SMILES CN(C)C(=O)c1csc(n1)C1COc2ccccc2O1
Show InChI InChI=1S/C14H14N2O3S/c1-16(2)14(17)9-8-20-13(15-9)12-7-18-10-5-3-4-6-11(10)19-12/h3-6,8,12H,7H2,1-2H3
NCI pathway
Reactome pathway
n/an/a 1.29E+5n/an/an/an/a7.522
Burnham Institute
Assay Description
Fluorescent assays were carried out in black 96-well plates. Caspase activity was monitored using a Labsystem Fluoroskan II spectrofluorometer with a...
J Med Chem 48: 1649-56 (2005)
Article DOI: 10.1021/jm0493212
BindingDB Entry DOI: 10.7270/Q2GT5KDJ
Caspase-8
(Homo sapiens (Human))
BDBM10221
(2-(2,3-dihydro-1,4-benzodioxin-2-yl)-N,N-dimethyl-...)
Show SMILES CN(C)C(=O)c1csc(n1)C1COc2ccccc2O1
Show InChI InChI=1S/C14H14N2O3S/c1-16(2)14(17)9-8-20-13(15-9)12-7-18-10-5-3-4-6-11(10)19-12/h3-6,8,12H,7H2,1-2H3
NCI pathway
Reactome pathway
n/an/a>2.00E+5n/an/an/an/an/an/a
Burnham Institute
Assay Description
Fluorescent assays were carried out in black 96-well plates. Caspase activity was monitored using a Labsystem Fluoroskan II spectrofluorometer with a...
J Med Chem 48: 1649-56 (2005)
Article DOI: 10.1021/jm0493212
BindingDB Entry DOI: 10.7270/Q2GT5KDJ
Caspase-7
(Homo sapiens (Human))
BDBM10221
(2-(2,3-dihydro-1,4-benzodioxin-2-yl)-N,N-dimethyl-...)
Show SMILES CN(C)C(=O)c1csc(n1)C1COc2ccccc2O1
Show InChI InChI=1S/C14H14N2O3S/c1-16(2)14(17)9-8-20-13(15-9)12-7-18-10-5-3-4-6-11(10)19-12/h3-6,8,12H,7H2,1-2H3
NCI pathway
Reactome pathway
n/an/a>2.00E+5n/an/an/an/an/an/a
Burnham Institute
Assay Description
Fluorescent assays were carried out in black 96-well plates. Caspase activity was monitored using a Labsystem Fluoroskan II spectrofluorometer with a...
J Med Chem 48: 1649-56 (2005)
Article DOI: 10.1021/jm0493212
BindingDB Entry DOI: 10.7270/Q2GT5KDJ