BDBM10225 2-(2,3-dihydro-1,4-benzodioxin-2-yl)-4-methyl-1,3-thiazole-5-carboxylic acid::BI-9C6::Burnham Institute Compound 11
SMILES: Cc1nc(sc1C(O)=O)C1COc2ccccc2O1
InChI Key: InChIKey=YZKRTPGIMBIDMW-UHFFFAOYSA-N
Data: 3 IC50
Activity Spreadsheet -- Enzyme Inhibition Constant Data from BindingDB
Found 3 hits for monomerid = 10225
Trg + Lig
Ki
nM
ΔG°
kcal/mole
IC50
nM
Kd
nM
EC50/IC50
nM
koff
s-1
kon
M-1s-1
pHTemp
°C
Caspase-3
(Homo sapiens (Human))
BDBM10225
(2-(2,3-dihydro-1,4-benzodioxin-2-yl)-4-methyl-1,3-...)
Show SMILES Cc1nc(sc1C(O)=O)C1COc2ccccc2O1
Show InChI InChI=1S/C13H11NO4S/c1-7-11(13(15)16)19-12(14-7)10-6-17-8-4-2-3-5-9(8)18-10/h2-5,10H,6H2,1H3,(H,15,16)
NCI pathway
Reactome pathway
n/an/a 1.28E+5n/an/an/an/a7.522
Burnham Institute
Assay Description
Fluorescent assays were carried out in black 96-well plates. Caspase activity was monitored using a Labsystem Fluoroskan II spectrofluorometer with a...
J Med Chem 48: 1649-56 (2005)
Article DOI: 10.1021/jm0493212
BindingDB Entry DOI: 10.7270/Q2GT5KDJ
Caspase-8
(Homo sapiens (Human))
BDBM10225
(2-(2,3-dihydro-1,4-benzodioxin-2-yl)-4-methyl-1,3-...)
Show SMILES Cc1nc(sc1C(O)=O)C1COc2ccccc2O1
Show InChI InChI=1S/C13H11NO4S/c1-7-11(13(15)16)19-12(14-7)10-6-17-8-4-2-3-5-9(8)18-10/h2-5,10H,6H2,1H3,(H,15,16)
NCI pathway
Reactome pathway
n/an/a>2.00E+5n/an/an/an/an/an/a
Burnham Institute
Assay Description
Fluorescent assays were carried out in black 96-well plates. Caspase activity was monitored using a Labsystem Fluoroskan II spectrofluorometer with a...
J Med Chem 48: 1649-56 (2005)
Article DOI: 10.1021/jm0493212
BindingDB Entry DOI: 10.7270/Q2GT5KDJ
Caspase-7
(Homo sapiens (Human))
BDBM10225
(2-(2,3-dihydro-1,4-benzodioxin-2-yl)-4-methyl-1,3-...)
Show SMILES Cc1nc(sc1C(O)=O)C1COc2ccccc2O1
Show InChI InChI=1S/C13H11NO4S/c1-7-11(13(15)16)19-12(14-7)10-6-17-8-4-2-3-5-9(8)18-10/h2-5,10H,6H2,1H3,(H,15,16)
NCI pathway
Reactome pathway
n/an/a>2.00E+5n/an/an/an/an/an/a
Burnham Institute
Assay Description
Fluorescent assays were carried out in black 96-well plates. Caspase activity was monitored using a Labsystem Fluoroskan II spectrofluorometer with a...
J Med Chem 48: 1649-56 (2005)
Article DOI: 10.1021/jm0493212
BindingDB Entry DOI: 10.7270/Q2GT5KDJ