BDBM10233 13-[(1,3-benzoxazol-2-ylsulfanyl)methyl]-5-chloro-2-ethyl-7-methyl-2,4,9,15-tetraazatricyclo[9.4.0.0^{3,8}]pentadeca-1(11),3,5,7,12,14-hexaen-10-one::8-heteroarylthiomethyldipyridodiazepinone deriv. 15
SMILES: CCN1c2nc(Cl)cc(C)c2NC(=O)c2cc(CSc3nc4ccccc4o3)cnc12
InChI Key: InChIKey=IEZOLPNZJAVUST-UHFFFAOYSA-N
Data: 2 IC50
Activity Spreadsheet -- Enzyme Inhibition Constant Data from BindingDB
Found 2 hits for monomerid = 10233
Trg + Lig
Ki
nM
ΔG°
kcal/mole
IC50
nM
Kd
nM
EC50/IC50
nM
koff
s-1
kon
M-1s-1
pHTemp
°C
HIV-1 Reverse Transcriptase Mutant (K103N/Y181C)
(Human immunodeficiency virus type 1)
BDBM10233
(13-[(1,3-benzoxazol-2-ylsulfanyl)methyl]-5-chloro-...)
Show SMILES CCN1c2nc(Cl)cc(C)c2NC(=O)c2cc(CSc3nc4ccccc4o3)cnc12
Show InChI InChI=1S/C22H18ClN5O2S/c1-3-28-19-14(21(29)27-18-12(2)8-17(23)26-20(18)28)9-13(10-24-19)11-31-22-25-15-6-4-5-7-16(15)30-22/h4-10H,3,11H2,1-2H3,(H,27,29)
n/an/a 230n/an/an/an/a7.437
Boehringer Ingelheim (Canada) Ltd.
Assay Description
IC50 values for wild-type and mutant RTs were obtained from a scintillation proximity assay using poly rC/biotin-dG15 and 3H-dGTP. Each value represe...
Bioorg Med Chem Lett 14: 739-42 (2004)
Article DOI: 10.1016/j.bmcl.2003.11.049
BindingDB Entry DOI: 10.7270/Q2C53J2D
HIV-1 Reverse Transcriptase
(Human immunodeficiency virus type 1)
BDBM10233
(13-[(1,3-benzoxazol-2-ylsulfanyl)methyl]-5-chloro-...)
Show SMILES CCN1c2nc(Cl)cc(C)c2NC(=O)c2cc(CSc3nc4ccccc4o3)cnc12
Show InChI InChI=1S/C22H18ClN5O2S/c1-3-28-19-14(21(29)27-18-12(2)8-17(23)26-20(18)28)9-13(10-24-19)11-31-22-25-15-6-4-5-7-16(15)30-22/h4-10H,3,11H2,1-2H3,(H,27,29)
n/an/a 8n/an/an/an/a7.437
Boehringer Ingelheim (Canada) Ltd.
Assay Description
IC50 values for wild-type and mutant RTs were obtained from a scintillation proximity assay using poly rC/biotin-dG15 and 3H-dGTP. Each value represe...
Bioorg Med Chem Lett 14: 739-42 (2004)
Article DOI: 10.1016/j.bmcl.2003.11.049
BindingDB Entry DOI: 10.7270/Q2C53J2D