BDBM102570 US8536172, I-19
SMILES: CCNC(=O)[C@H]1CC[C@@H](CC1)Nc1nccc(n1)-n1ccc2c(cccc12)N1CCC(CC1)S(C)(=O)=O
InChI Key: InChIKey=ACBXKRVHJBHPEG-MXVIHJGJSA-N
Data: 2 IC50
Activity Spreadsheet -- Enzyme Inhibition Constant Data from BindingDB
Found 2 hits for monomerid = 102570
Trg + Lig
Ki
nM
ΔG°
kcal/mole
IC50
nM
Kd
nM
EC50/IC50
nM
koff
s-1
kon
M-1s-1
pHTemp
°C
Mitogen-activated protein kinase 8
(Homo sapiens (Human))
BDBM102570
(US8536172, I-19)
Show SMILES CCNC(=O)[C@H]1CC[C@@H](CC1)Nc1nccc(n1)-n1ccc2c(cccc12)N1CCC(CC1)S(C)(=O)=O |r,wU:8.11,wD:5.4,(-2.41,-5.01,;-3.75,-4.24,;-5.08,-5.01,;-6.41,-4.24,;-7.75,-5.01,;-6.41,-2.7,;-5.08,-1.93,;-5.08,-.39,;-6.41,.38,;-7.75,-.39,;-7.75,-1.93,;-6.41,1.92,;-5.08,2.69,;-5.08,4.23,;-3.75,5.01,;-2.41,4.23,;-2.41,2.69,;-3.75,1.92,;-1.08,1.92,;.39,2.4,;1.29,1.15,;.39,-.09,;.71,-1.6,;-.44,-2.63,;-1.9,-2.15,;-2.22,-.65,;-1.08,.38,;2.19,-2,;2.59,-3.48,;4.08,-3.88,;5.17,-2.79,;4.77,-1.31,;3.28,-.91,;6.66,-3.19,;5.57,-4.28,;7.75,-2.1,;7.06,-4.68,)|
Show InChI InChI=1S/C27H36N6O3S/c1-3-28-26(34)19-7-9-20(10-8-19)30-27-29-15-11-25(31-27)33-18-14-22-23(5-4-6-24(22)33)32-16-12-21(13-17-32)37(2,35)36/h4-6,11,14-15,18-21H,3,7-10,12-13,16-17H2,1-2H3,(H,28,34)(H,29,30,31)/t19-,20-
NCI pathway
Reactome pathway
US Patent
n/an/a 32.8n/an/an/an/a7.5n/a
Roche Palo Alto LLC
US Patent
Assay Description
JNK activity was measured by phosphorylation of GST-ATF2 (19-96) with [gamma-33P] ATP.
US Patent US8536172 (2013)
BindingDB Entry DOI: 10.7270/Q23N222K
Mitogen-activated protein kinase 8
(Homo sapiens (Human))
BDBM102570
(US8536172, I-19)
Show SMILES CCNC(=O)[C@H]1CC[C@@H](CC1)Nc1nccc(n1)-n1ccc2c(cccc12)N1CCC(CC1)S(C)(=O)=O |r,wU:8.11,wD:5.4,(-2.41,-5.01,;-3.75,-4.24,;-5.08,-5.01,;-6.41,-4.24,;-7.75,-5.01,;-6.41,-2.7,;-5.08,-1.93,;-5.08,-.39,;-6.41,.38,;-7.75,-.39,;-7.75,-1.93,;-6.41,1.92,;-5.08,2.69,;-5.08,4.23,;-3.75,5.01,;-2.41,4.23,;-2.41,2.69,;-3.75,1.92,;-1.08,1.92,;.39,2.4,;1.29,1.15,;.39,-.09,;.71,-1.6,;-.44,-2.63,;-1.9,-2.15,;-2.22,-.65,;-1.08,.38,;2.19,-2,;2.59,-3.48,;4.08,-3.88,;5.17,-2.79,;4.77,-1.31,;3.28,-.91,;6.66,-3.19,;5.57,-4.28,;7.75,-2.1,;7.06,-4.68,)|
Show InChI InChI=1S/C27H36N6O3S/c1-3-28-26(34)19-7-9-20(10-8-19)30-27-29-15-11-25(31-27)33-18-14-22-23(5-4-6-24(22)33)32-16-12-21(13-17-32)37(2,35)36/h4-6,11,14-15,18-21H,3,7-10,12-13,16-17H2,1-2H3,(H,28,34)(H,29,30,31)/t19-,20-
NCI pathway
Reactome pathway
US Patent
n/an/a 6.10n/an/an/an/a7.5n/a
Roche Palo Alto LLC
US Patent
Assay Description
JNK activity was measured by phosphorylation of GST-ATF2 (19-96) with [gamma-33P] ATP.
US Patent US8536172 (2013)
BindingDB Entry DOI: 10.7270/Q23N222K