null
SMILES: CC(C)(C)OC(=O)NCC(=O)N1CCN(CC1)c1cccc2n(ccc12)-c1ccnc(N[C@H]2CC[C@@H](CC2)NS(C)(=O)=O)n1
InChI Key: InChIKey=DQYHKJAYIFIGKD-HZCBDIJESA-N
Activity Spreadsheet -- Enzyme Inhibition Constant Data from BindingDB
Found 2 hits for monomerid = 102573
Trg + Lig
Ki
nM
ΔG°
kcal/mole
IC50
nM
Kd
nM
EC50/IC50
nM
koff
s-1
kon
M-1s-1
pHTemp
°C
Mitogen-activated protein kinase 8
(Homo sapiens (Human))
BDBM102573
(US8536172, I-22)
Show SMILES CC(C)(C)OC(=O)NCC(=O)N1CCN(CC1)c1cccc2n(ccc12)-c1ccnc(N[C@H]2CC[C@@H](CC2)NS(C)(=O)=O)n1 |r,wU:32.34,wD:35.41,(10.7,-6.58,;9.21,-6.18,;8.12,-7.27,;9.61,-4.7,;8.81,-4.7,;7.32,-4.3,;6.24,-5.39,;6.93,-2.81,;5.44,-2.41,;5.04,-.92,;6.13,.17,;3.55,-.53,;2.46,-1.61,;.98,-1.22,;.58,.27,;1.67,1.36,;3.15,.96,;-.91,.67,;-2.06,-.36,;-3.52,.12,;-3.84,1.62,;-2.7,2.65,;-2.7,4.19,;-1.23,4.67,;-.33,3.42,;-1.23,2.18,;-4.03,4.96,;-4.03,6.5,;-5.36,7.27,;-6.7,6.5,;-6.7,4.96,;-8.03,4.19,;-8.03,2.65,;-6.7,1.88,;-6.7,.34,;-8.03,-.43,;-9.36,.34,;-9.36,1.88,;-8.03,-1.97,;-9.36,-2.74,;-10.7,-1.97,;-9.36,-4.28,;-8.03,-3.51,;-5.36,4.19,)|
Show InChI InChI=1S/C30H42N8O5S/c1-30(2,3)43-29(40)32-20-27(39)37-18-16-36(17-19-37)24-6-5-7-25-23(24)13-15-38(25)26-12-14-31-28(34-26)33-21-8-10-22(11-9-21)35-44(4,41)42/h5-7,12-15,21-22,35H,8-11,16-20H2,1-4H3,(H,32,40)(H,31,33,34)/t21-,22-
NCI pathway
Reactome pathway
US Patent
n/an/a 26.4n/an/an/an/a7.5n/a
Roche Palo Alto LLC
US Patent
Assay Description
JNK activity was measured by phosphorylation of GST-ATF2 (19-96) with [gamma-33P] ATP.
US Patent US8536172 (2013)
BindingDB Entry DOI: 10.7270/Q23N222K
Mitogen-activated protein kinase 8
(Homo sapiens (Human))
BDBM102573
(US8536172, I-22)
Show SMILES CC(C)(C)OC(=O)NCC(=O)N1CCN(CC1)c1cccc2n(ccc12)-c1ccnc(N[C@H]2CC[C@@H](CC2)NS(C)(=O)=O)n1 |r,wU:32.34,wD:35.41,(10.7,-6.58,;9.21,-6.18,;8.12,-7.27,;9.61,-4.7,;8.81,-4.7,;7.32,-4.3,;6.24,-5.39,;6.93,-2.81,;5.44,-2.41,;5.04,-.92,;6.13,.17,;3.55,-.53,;2.46,-1.61,;.98,-1.22,;.58,.27,;1.67,1.36,;3.15,.96,;-.91,.67,;-2.06,-.36,;-3.52,.12,;-3.84,1.62,;-2.7,2.65,;-2.7,4.19,;-1.23,4.67,;-.33,3.42,;-1.23,2.18,;-4.03,4.96,;-4.03,6.5,;-5.36,7.27,;-6.7,6.5,;-6.7,4.96,;-8.03,4.19,;-8.03,2.65,;-6.7,1.88,;-6.7,.34,;-8.03,-.43,;-9.36,.34,;-9.36,1.88,;-8.03,-1.97,;-9.36,-2.74,;-10.7,-1.97,;-9.36,-4.28,;-8.03,-3.51,;-5.36,4.19,)|
Show InChI InChI=1S/C30H42N8O5S/c1-30(2,3)43-29(40)32-20-27(39)37-18-16-36(17-19-37)24-6-5-7-25-23(24)13-15-38(25)26-12-14-31-28(34-26)33-21-8-10-22(11-9-21)35-44(4,41)42/h5-7,12-15,21-22,35H,8-11,16-20H2,1-4H3,(H,32,40)(H,31,33,34)/t21-,22-
NCI pathway
Reactome pathway
US Patent
n/an/a 3.60n/an/an/an/a7.5n/a
Roche Palo Alto LLC
US Patent
Assay Description
JNK activity was measured by phosphorylation of GST-ATF2 (19-96) with [gamma-33P] ATP.
US Patent US8536172 (2013)
BindingDB Entry DOI: 10.7270/Q23N222K