BDBM102617 US8536172, I-66
SMILES: CS(=O)(=O)C1CCN(CC1)c1cccc2n(ncc12)-c1ccnc(N[C@H]2CC[C@H](O)CC2)n1
InChI Key: InChIKey=SSWFFPALFQMQLE-QAQDUYKDSA-N
Data: 5 IC50
Activity Spreadsheet -- Enzyme Inhibition Constant Data from BindingDB
Found 5 hits for monomerid = 102617
Trg + Lig
Ki
nM
ΔG°
kcal/mole
IC50
nM
Kd
nM
EC50/IC50
nM
koff
s-1
kon
M-1s-1
pHTemp
°C
Mitogen-activated protein kinase 8
(Homo sapiens (Human))
BDBM102617
(US8536172, I-66)
Show SMILES CS(=O)(=O)C1CCN(CC1)c1cccc2n(ncc12)-c1ccnc(N[C@H]2CC[C@H](O)CC2)n1 |r,wU:25.27,wD:28.31,(10.53,3.6,;9.19,2.83,;8.42,4.17,;9.96,1.5,;7.86,2.06,;7.86,.52,;6.52,-.25,;5.19,.52,;5.19,2.06,;6.52,2.83,;3.86,-.25,;3.86,-1.79,;2.52,-2.56,;1.19,-1.79,;1.19,-.25,;.04,.78,;.67,2.19,;2.2,2.03,;2.52,.52,;-1.5,.78,;-2.27,2.12,;-3.81,2.12,;-4.58,.78,;-3.81,-.55,;-4.58,-1.88,;-6.06,-2.28,;-6.46,-3.77,;-7.95,-4.17,;-9.04,-3.08,;-10.53,-3.48,;-8.64,-1.59,;-7.15,-1.19,;-2.27,-.55,)|
Show InChI InChI=1S/C23H30N6O3S/c1-33(31,32)18-10-13-28(14-11-18)20-3-2-4-21-19(20)15-25-29(21)22-9-12-24-23(27-22)26-16-5-7-17(30)8-6-16/h2-4,9,12,15-18,30H,5-8,10-11,13-14H2,1H3,(H,24,26,27)/t16-,17-
NCI pathway
Reactome pathway
US Patent
n/an/a 5.80n/an/an/an/a7.5n/a
Roche Palo Alto LLC
US Patent
Assay Description
JNK activity was measured by phosphorylation of GST-ATF2 (19-96) with [gamma-33P] ATP.
US Patent US8536172 (2013)
BindingDB Entry DOI: 10.7270/Q23N222K
Mitogen-activated protein kinase 8
(Homo sapiens (Human))
BDBM102617
(US8536172, I-66)
Show SMILES CS(=O)(=O)C1CCN(CC1)c1cccc2n(ncc12)-c1ccnc(N[C@H]2CC[C@H](O)CC2)n1 |r,wU:25.27,wD:28.31,(10.53,3.6,;9.19,2.83,;8.42,4.17,;9.96,1.5,;7.86,2.06,;7.86,.52,;6.52,-.25,;5.19,.52,;5.19,2.06,;6.52,2.83,;3.86,-.25,;3.86,-1.79,;2.52,-2.56,;1.19,-1.79,;1.19,-.25,;.04,.78,;.67,2.19,;2.2,2.03,;2.52,.52,;-1.5,.78,;-2.27,2.12,;-3.81,2.12,;-4.58,.78,;-3.81,-.55,;-4.58,-1.88,;-6.06,-2.28,;-6.46,-3.77,;-7.95,-4.17,;-9.04,-3.08,;-10.53,-3.48,;-8.64,-1.59,;-7.15,-1.19,;-2.27,-.55,)|
Show InChI InChI=1S/C23H30N6O3S/c1-33(31,32)18-10-13-28(14-11-18)20-3-2-4-21-19(20)15-25-29(21)22-9-12-24-23(27-22)26-16-5-7-17(30)8-6-16/h2-4,9,12,15-18,30H,5-8,10-11,13-14H2,1H3,(H,24,26,27)/t16-,17-
NCI pathway
Reactome pathway
US Patent
n/an/a 16.7n/an/an/an/a7.5n/a
Roche Palo Alto LLC
US Patent
Assay Description
JNK activity was measured by phosphorylation of GST-ATF2 (19-96) with [gamma-33P] ATP.
US Patent US8536172 (2013)
BindingDB Entry DOI: 10.7270/Q23N222K
Mitogen-activated protein kinase 8
(Homo sapiens (Human))
BDBM102617
(US8536172, I-66)
Show SMILES CS(=O)(=O)C1CCN(CC1)c1cccc2n(ncc12)-c1ccnc(N[C@H]2CC[C@H](O)CC2)n1 |r,wU:25.27,wD:28.31,(10.53,3.6,;9.19,2.83,;8.42,4.17,;9.96,1.5,;7.86,2.06,;7.86,.52,;6.52,-.25,;5.19,.52,;5.19,2.06,;6.52,2.83,;3.86,-.25,;3.86,-1.79,;2.52,-2.56,;1.19,-1.79,;1.19,-.25,;.04,.78,;.67,2.19,;2.2,2.03,;2.52,.52,;-1.5,.78,;-2.27,2.12,;-3.81,2.12,;-4.58,.78,;-3.81,-.55,;-4.58,-1.88,;-6.06,-2.28,;-6.46,-3.77,;-7.95,-4.17,;-9.04,-3.08,;-10.53,-3.48,;-8.64,-1.59,;-7.15,-1.19,;-2.27,-.55,)|
Show InChI InChI=1S/C23H30N6O3S/c1-33(31,32)18-10-13-28(14-11-18)20-3-2-4-21-19(20)15-25-29(21)22-9-12-24-23(27-22)26-16-5-7-17(30)8-6-16/h2-4,9,12,15-18,30H,5-8,10-11,13-14H2,1H3,(H,24,26,27)/t16-,17-
NCI pathway
Reactome pathway
n/an/a 6n/an/an/an/an/an/a
Roche Palo Alto
Curated by ChEMBL
Assay Description
Inhibition of human JNK1alpha1 using GST-tagged ATF2 as substrate preincubated for 10 mins prior to substrate addition measured after 30 mins by micr...
Bioorg Med Chem Lett 23: 3565-9 (2013)
Article DOI: 10.1016/j.bmcl.2013.04.029
BindingDB Entry DOI: 10.7270/Q2MG7SF1
Mitogen-activated protein kinase 9
(Homo sapiens (Human))
BDBM102617
(US8536172, I-66)
Show SMILES CS(=O)(=O)C1CCN(CC1)c1cccc2n(ncc12)-c1ccnc(N[C@H]2CC[C@H](O)CC2)n1 |r,wU:25.27,wD:28.31,(10.53,3.6,;9.19,2.83,;8.42,4.17,;9.96,1.5,;7.86,2.06,;7.86,.52,;6.52,-.25,;5.19,.52,;5.19,2.06,;6.52,2.83,;3.86,-.25,;3.86,-1.79,;2.52,-2.56,;1.19,-1.79,;1.19,-.25,;.04,.78,;.67,2.19,;2.2,2.03,;2.52,.52,;-1.5,.78,;-2.27,2.12,;-3.81,2.12,;-4.58,.78,;-3.81,-.55,;-4.58,-1.88,;-6.06,-2.28,;-6.46,-3.77,;-7.95,-4.17,;-9.04,-3.08,;-10.53,-3.48,;-8.64,-1.59,;-7.15,-1.19,;-2.27,-.55,)|
Show InChI InChI=1S/C23H30N6O3S/c1-33(31,32)18-10-13-28(14-11-18)20-3-2-4-21-19(20)15-25-29(21)22-9-12-24-23(27-22)26-16-5-7-17(30)8-6-16/h2-4,9,12,15-18,30H,5-8,10-11,13-14H2,1H3,(H,24,26,27)/t16-,17-
NCI pathway
Reactome pathway
n/an/a 17n/an/an/an/an/an/a
Roche Palo Alto
Curated by ChEMBL
Assay Description
Inhibition of human JNK2alpha2 using GST-tagged ATF2 as substrate preincubated for 10 mins prior to substrate addition measured after 30 mins by micr...
Bioorg Med Chem Lett 23: 3565-9 (2013)
Article DOI: 10.1016/j.bmcl.2013.04.029
BindingDB Entry DOI: 10.7270/Q2MG7SF1
Mitogen-activated protein kinase 10/8/9
(Homo sapiens (Human))
BDBM102617
(US8536172, I-66)
Show SMILES CS(=O)(=O)C1CCN(CC1)c1cccc2n(ncc12)-c1ccnc(N[C@H]2CC[C@H](O)CC2)n1 |r,wU:25.27,wD:28.31,(10.53,3.6,;9.19,2.83,;8.42,4.17,;9.96,1.5,;7.86,2.06,;7.86,.52,;6.52,-.25,;5.19,.52,;5.19,2.06,;6.52,2.83,;3.86,-.25,;3.86,-1.79,;2.52,-2.56,;1.19,-1.79,;1.19,-.25,;.04,.78,;.67,2.19,;2.2,2.03,;2.52,.52,;-1.5,.78,;-2.27,2.12,;-3.81,2.12,;-4.58,.78,;-3.81,-.55,;-4.58,-1.88,;-6.06,-2.28,;-6.46,-3.77,;-7.95,-4.17,;-9.04,-3.08,;-10.53,-3.48,;-8.64,-1.59,;-7.15,-1.19,;-2.27,-.55,)|
Show InChI InChI=1S/C23H30N6O3S/c1-33(31,32)18-10-13-28(14-11-18)20-3-2-4-21-19(20)15-25-29(21)22-9-12-24-23(27-22)26-16-5-7-17(30)8-6-16/h2-4,9,12,15-18,30H,5-8,10-11,13-14H2,1H3,(H,24,26,27)/t16-,17-
NCI pathway
Reactome pathway
n/an/a 290n/an/an/an/an/an/a
Roche Palo Alto
Curated by ChEMBL
Assay Description
Inhibition of JNK-mediated c-Jun activation in TNFalpha-induced human SW1353 cells preincubated for 30 mins prior to TNFalpha treatment measured afte...
Bioorg Med Chem Lett 23: 3565-9 (2013)
Article DOI: 10.1016/j.bmcl.2013.04.029
BindingDB Entry DOI: 10.7270/Q2MG7SF1