BDBM102679 US8541572, 986
SMILES: COc1ccc2CN(C[C@]3(NC(=O)NC3=O)C#Cc3ccc(cc3)-c3nc(ccc3O)-c3cnn(C)c3)C(=O)c2c1F
InChI Key: InChIKey=WRRSXVWQBFKQBS-SSEXGKCCSA-N
Data: 1 KI  1 IC50
Activity Spreadsheet -- Enzyme Inhibition Constant Data from BindingDB
Found 1 hit for monomerid = 102679
Trg + Lig
Ki
nM
ΔG°
kcal/mole
IC50
nM
Kd
nM
EC50/IC50
nM
koff
s-1
kon
M-1s-1
pHTemp
°C
Tumor necrosis factor
(Homo sapiens (Human))
BDBM102679
(US8541572, 986)
Show SMILES COc1ccc2CN(C[C@]3(NC(=O)NC3=O)C#Cc3ccc(cc3)-c3nc(ccc3O)-c3cnn(C)c3)C(=O)c2c1F |r|
Show InChI InChI=1S/C30H23FN6O5/c1-36-14-20(13-32-36)21-8-9-22(38)26(33-21)18-5-3-17(4-6-18)11-12-30(28(40)34-29(41)35-30)16-37-15-19-7-10-23(42-2)25(31)24(19)27(37)39/h3-10,13-14,38H,15-16H2,1-2H3,(H2,34,35,40,41)/t30-/m1/s1
Reactome pathway
US Patent
0.0973n/a 87n/an/an/an/an/an/a
Merck Sharp & Dohme Corp.
US Patent
Assay Description
Inhibition assay using TNF-alpha.
US Patent US8541572 (2013)
BindingDB Entry DOI: 10.7270/Q2QC024J