BDBM102694 US8541572, 1001
SMILES: COc1ccc2CN(C[C@]3(NC(=O)NC3=O)C#Cc3ccc(cc3)-c3nc(ccc3O)-c3cccnc3)C(=O)c2c1F
InChI Key: InChIKey=YRQXTHXMHPBGAB-WJOKGBTCSA-N
Data: 1 KI  1 IC50
Activity Spreadsheet -- Enzyme Inhibition Constant Data from BindingDB
Found 1 hit for monomerid = 102694
Trg + Lig
Ki
nM
ΔG°
kcal/mole
IC50
nM
Kd
nM
EC50/IC50
nM
koff
s-1
kon
M-1s-1
pHTemp
°C
Tumor necrosis factor
(Homo sapiens (Human))
BDBM102694
(US8541572, 1001)
Show SMILES COc1ccc2CN(C[C@]3(NC(=O)NC3=O)C#Cc3ccc(cc3)-c3nc(ccc3O)-c3cccnc3)C(=O)c2c1F |r|
Show InChI InChI=1S/C31H22FN5O5/c1-42-24-11-8-21-16-37(28(39)25(21)26(24)32)17-31(29(40)35-30(41)36-31)13-12-18-4-6-19(7-5-18)27-23(38)10-9-22(34-27)20-3-2-14-33-15-20/h2-11,14-15,38H,16-17H2,1H3,(H2,35,36,40,41)/t31-/m1/s1
Reactome pathway
US Patent
0.0781n/a 106n/an/an/an/an/an/a
Merck Sharp & Dohme Corp.
US Patent
Assay Description
Inhibition assay using TNF-alpha.
US Patent US8541572 (2013)
BindingDB Entry DOI: 10.7270/Q2QC024J