BDBM102834 US8541572, 911
SMILES: CCN1CCN(CC1)C(N=O)c1ccc(cc1)C#C[C@]1(CN2Cc3ccc(OC)cc3C2=O)NC(=O)NC1=O
InChI Key: InChIKey=VDOWSKDQCMQOCN-ITCMONMYSA-N
Data: 1 KI  1 IC50
Activity Spreadsheet -- Enzyme Inhibition Constant Data from BindingDB
Found 1 hit for monomerid = 102834
Trg + Lig
Ki
nM
ΔG°
kcal/mole
IC50
nM
Kd
nM
EC50/IC50
nM
koff
s-1
kon
M-1s-1
pHTemp
°C
Tumor necrosis factor
(Homo sapiens (Human))
BDBM102834
(US8541572, 911)
Show SMILES CCN1CCN(CC1)C(N=O)c1ccc(cc1)C#C[C@]1(CN2Cc3ccc(OC)cc3C2=O)NC(=O)NC1=O |r|
Show InChI InChI=1S/C28H30N6O5/c1-3-32-12-14-33(15-13-32)24(31-38)20-6-4-19(5-7-20)10-11-28(26(36)29-27(37)30-28)18-34-17-21-8-9-22(39-2)16-23(21)25(34)35/h4-9,16,24H,3,12-15,17-18H2,1-2H3,(H2,29,30,36,37)/t24?,28-/m1/s1
Reactome pathway
US Patent
0.160n/a 20n/an/an/an/an/an/a
Merck Sharp & Dohme Corp.
US Patent
Assay Description
Inhibition assay using TNF-alpha.
US Patent US8541572 (2013)
BindingDB Entry DOI: 10.7270/Q2QC024J