BDBM102849 US8541572, 931
SMILES: COc1ccc2CN(C[C@]3(NC(=O)NC3=O)C#Cc3ccc(cc3)C(=NO)N3CCCN(CC3)C(C)C)C(=O)c2c1
InChI Key: InChIKey=QNZRTJWRJTWXMA-SSEXGKCCSA-N
Data: 1 KI  1 IC50
Activity Spreadsheet -- Enzyme Inhibition Constant Data from BindingDB
Found 1 hit for monomerid = 102849
Trg + Lig
Ki
nM
ΔG°
kcal/mole
IC50
nM
Kd
nM
EC50/IC50
nM
koff
s-1
kon
M-1s-1
pHTemp
°C
Tumor necrosis factor
(Homo sapiens (Human))
BDBM102849
(US8541572, 931)
Show SMILES COc1ccc2CN(C[C@]3(NC(=O)NC3=O)C#Cc3ccc(cc3)C(=NO)N3CCCN(CC3)C(C)C)C(=O)c2c1 |r,w:25.27|
Show InChI InChI=1S/C30H34N6O5/c1-20(2)34-13-4-14-35(16-15-34)26(33-40)22-7-5-21(6-8-22)11-12-30(28(38)31-29(39)32-30)19-36-18-23-9-10-24(41-3)17-25(23)27(36)37/h5-10,17,20,40H,4,13-16,18-19H2,1-3H3,(H2,31,32,38,39)/t30-/m1/s1
Reactome pathway
US Patent
0.190n/a 47n/an/an/an/an/an/a
Merck Sharp & Dohme Corp.
US Patent
Assay Description
Inhibition assay using TNF-alpha.
US Patent US8541572 (2013)
BindingDB Entry DOI: 10.7270/Q2QC024J