BDBM102964 US8541427, 35
SMILES: COc1nc(nc(C2CC2)c1Cl)N1C[C@H]2C(=O)N(C)C(N)=N[C@]2(C1)c1cc(F)ccc1F
InChI Key: InChIKey=IZPZFKYSOPTHAX-YEJXKQKISA-N
Data: 1 KI  1 IC50
Activity Spreadsheet -- Enzyme Inhibition Constant Data from BindingDB
Found 1 hit for monomerid = 102964
Trg + Lig
Ki
nM
ΔG°
kcal/mole
IC50
nM
Kd
nM
EC50/IC50
nM
koff
s-1
kon
M-1s-1
pHTemp
°C
Beta-secretase 1
(Homo sapiens (Human))
BDBM102964
(US8541427, 35)
Show SMILES COc1nc(nc(C2CC2)c1Cl)N1C[C@H]2C(=O)N(C)C(N)=N[C@]2(C1)c1cc(F)ccc1F |r,c:22|
Show InChI InChI=1S/C21H21ClF2N6O2/c1-29-18(31)13-8-30(20-26-16(10-3-4-10)15(22)17(27-20)32-2)9-21(13,28-19(29)25)12-7-11(23)5-6-14(12)24/h5-7,10,13H,3-4,8-9H2,1-2H3,(H2,25,28)/t13-,21+/m0/s1
US Patent
6.5 -11.3 90n/an/an/an/an/a30
Merck, Sharp & Dohme, Corp.
US Patent
Assay Description
A homogeneous time-resolved FRET assay was used to determine IC50 values for inhibitors of the soluble human BACE1 catalytic domain. The assay monit...
US Patent US8541427 (2013)
BindingDB Entry DOI: 10.7270/Q26D5RN4