BDBM103305 US8546434, 2
SMILES: C[C@H]1CN(C[C@@H](C)O1)C(=O)N(C[C@@H]1CNC[C@@H]1F)[C@@H](c1nc(nn1Cc1ccccc1)-c1cc(F)ccc1F)C(C)(C)C
InChI Key: InChIKey=AWBVBYIKAUDSGH-KHNIKYAWSA-N
Data: 1 IC50
Activity Spreadsheet -- Enzyme Inhibition Constant Data from BindingDB
Found 1 hit for monomerid = 103305
Trg + Lig
Ki
nM
ΔG°
kcal/mole
IC50
nM
Kd
nM
EC50/IC50
nM
koff
s-1
kon
M-1s-1
pHTemp
°C
kinesin spindle protein
(Homo sapiens (Human))
BDBM103305
(US8546434, 2)
Show SMILES C[C@H]1CN(C[C@@H](C)O1)C(=O)N(C[C@@H]1CNC[C@@H]1F)[C@@H](c1nc(nn1Cc1ccccc1)-c1cc(F)ccc1F)C(C)(C)C |r|
Show InChI InChI=1S/C32H41F3N6O2/c1-20-16-39(17-21(2)43-20)31(42)40(19-23-14-36-15-27(23)35)28(32(3,4)5)30-37-29(25-13-24(33)11-12-26(25)34)38-41(30)18-22-9-7-6-8-10-22/h6-13,20-21,23,27-28,36H,14-19H2,1-5H3/t20-,21+,23-,27-,28-/m0/s1
Reactome pathway
US Patent
n/an/a 0.830n/an/an/an/a7.537
Novartis AG
US Patent
Assay Description
In vitro activity assay using KSP.
US Patent US8546434 (2013)
BindingDB Entry DOI: 10.7270/Q25D8QG9