BDBM103684 US8563553, 109
SMILES: COC(=O)N[C@@H](C)CNc1nccc(n1)-c1nc([nH]c1-c1cc(F)cc(NS(=O)(=O)c2c(F)cccc2F)c1Cl)C1CC1
InChI Key: InChIKey=MAAASDSZPOGPGE-ZDUSSCGKSA-N
Data: 1 IC50
Activity Spreadsheet -- Enzyme Inhibition Constant Data from BindingDB
Found 1 hit for monomerid = 103684
Trg + Lig
Ki
nM
ΔG°
kcal/mole
IC50
nM
Kd
nM
EC50/IC50
nM
koff
s-1
kon
M-1s-1
pHTemp
°C
B-RAF V600E
(Homo sapiens (Human))
BDBM103684
(US8563553, 109)
Show SMILES COC(=O)N[C@@H](C)CNc1nccc(n1)-c1nc([nH]c1-c1cc(F)cc(NS(=O)(=O)c2c(F)cccc2F)c1Cl)C1CC1 |r|
Show InChI InChI=1S/C27H25ClF3N7O4S/c1-13(34-27(39)42-2)12-33-26-32-9-8-19(35-26)23-22(36-25(37-23)14-6-7-14)16-10-15(29)11-20(21(16)28)38-43(40,41)24-17(30)4-3-5-18(24)31/h3-5,8-11,13-14,38H,6-7,12H2,1-2H3,(H,34,39)(H,36,37)(H,32,33,35)/t13-/m0/s1
US Patent
n/an/a 0.100n/an/an/an/a7.5n/a
Novartis AG; IRM LLC
US Patent
Assay Description
Raf/Mek amplified luminescence proximity homogeneous assay.
US Patent US8563553 (2013)
BindingDB Entry DOI: 10.7270/Q2ZP44R7