BDBM103905 JNK3 inhibitor 2::US8563583, C-1
SMILES: COc1cc(ccc1OCCO)-n1ccc(cc1=O)-c1ccc(OC(F)(F)F)cc1
InChI Key: InChIKey=JCLKKRZMUZBICB-UHFFFAOYSA-N
Data: 1 KI  1 IC50
Activity Spreadsheet -- Enzyme Inhibition Constant Data from BindingDB
Found 2 hits for monomerid = 103905
Trg + Lig
Ki
nM
ΔG°
kcal/mole
IC50
nM
Kd
nM
EC50/IC50
nM
koff
s-1
kon
M-1s-1
pHTemp
°C
Melanin-concentrating hormone receptor 1
(Homo sapiens (Human))
BDBM103905
(JNK3 inhibitor 2 | US8563583, C-1)
Show SMILES COc1cc(ccc1OCCO)-n1ccc(cc1=O)-c1ccc(OC(F)(F)F)cc1
Show InChI InChI=1S/C21H18F3NO5/c1-28-19-13-16(4-7-18(19)29-11-10-26)25-9-8-15(12-20(25)27)14-2-5-17(6-3-14)30-21(22,23)24/h2-9,12-13,26H,10-11H2,1H3
Reactome pathway
US Patent
3n/an/an/an/an/an/a7.4n/a
Bristol-Myers Squibb Company
US Patent
Assay Description
Compounds were characterized in an in vitro binding assay to determine their Ki or ability to antagonized binding of a peptide agonist to the human m...
US Patent US8563583 (2013)
BindingDB Entry DOI: 10.7270/Q22F7M2Q
Mitogen-activated protein kinase 10
(Homo sapiens (Human))
BDBM103905
(JNK3 inhibitor 2 | US8563583, C-1)
Show SMILES COc1cc(ccc1OCCO)-n1ccc(cc1=O)-c1ccc(OC(F)(F)F)cc1
Show InChI InChI=1S/C21H18F3NO5/c1-28-19-13-16(4-7-18(19)29-11-10-26)25-9-8-15(12-20(25)27)14-2-5-17(6-3-14)30-21(22,23)24/h2-9,12-13,26H,10-11H2,1H3
NCI pathway
Reactome pathway
n/an/a 136n/an/an/an/an/an/a
The Scripps Research Institute
ACS Chem Biol 8: 1747-54 (2013)
Article DOI: 10.1021/cb3006165
BindingDB Entry DOI: 10.7270/Q25719PN