BDBM104024 MK315
SMILES: OC(=O)COc1cc(Cl)ccc1C(=O)NCc1ccc(I)cc1F
InChI Key: InChIKey=ATJRPHWOUZQPIU-UHFFFAOYSA-N
Data: 1 IC50
PDB links: 1 PDB ID matches this monomer.
Activity Spreadsheet -- Enzyme Inhibition Constant Data from BindingDB
Found 1 hit for monomerid = 104024
Trg + Lig
Ki
nM
ΔG°
kcal/mole
IC50
nM
Kd
nM
EC50/IC50
nM
koff
s-1
kon
M-1s-1
pHTemp
°C
Aldose reductase (AR)
(Homo sapiens (Human))
BDBM104024
(MK315)
Show SMILES OC(=O)COc1cc(Cl)ccc1C(=O)NCc1ccc(I)cc1F
Show InChI InChI=1S/C16H12ClFINO4/c17-10-2-4-12(14(5-10)24-8-15(21)22)16(23)20-7-9-1-3-11(19)6-13(9)18/h1-6H,7-8H2,(H,20,23)(H,21,22)
n/an/a 190n/an/an/an/a7.025
Academy of Sciences of the Czech Republic
Assay Description
The assays were performed at 25 degrees Celsius in a 100mM sodium phosphate buffer (pH 7.0), with the AR protein amount reaching the Vmax and 0.2mM N...
ACS Chem Biol 8: 2484-92 (2013)
Article DOI: 10.1021/cb400526n
BindingDB Entry DOI: 10.7270/Q2HH6HQB
3D
3D Structure (crystal)