BDBM104188 US8575145, 65
SMILES: CC(C)(CN)COc1cccc2ccc(nc12)-c1nnc2ccc(cn12)-c1ccccc1
InChI Key: InChIKey=LLCBENGUWIODIZ-UHFFFAOYSA-N
Data: 2 IC50
Activity Spreadsheet -- Enzyme Inhibition Constant Data from BindingDB
Found 2 hits for monomerid = 104188
Trg + Lig
Ki
nM
ΔG°
kcal/mole
IC50
nM
Kd
nM
EC50/IC50
nM
koff
s-1
kon
M-1s-1
pHTemp
°C
Serine/threonine-protein kinase pim-2
(Homo sapiens (Human))
BDBM104188
(US8575145, 65)
Show SMILES CC(C)(CN)COc1cccc2ccc(nc12)-c1nnc2ccc(cn12)-c1ccccc1
Show InChI InChI=1S/C26H25N5O/c1-26(2,16-27)17-32-22-10-6-9-19-11-13-21(28-24(19)22)25-30-29-23-14-12-20(15-31(23)25)18-7-4-3-5-8-18/h3-15H,16-17,27H2,1-2H3
US Patent
n/an/a 174n/an/an/an/a7.422
Array BioPharma Inc.
US Patent
Assay Description
The assay for the determination of PIM activity is based on the incorporation of [33P] ATP into PIM2tide substrate and capture of the radiolabeled pe...
US Patent US8575145 (2013)
BindingDB Entry DOI: 10.7270/Q2M90797
Serine/threonine-protein kinase pim-1
(Homo sapiens (Human))
BDBM104188
(US8575145, 65)
Show SMILES CC(C)(CN)COc1cccc2ccc(nc12)-c1nnc2ccc(cn12)-c1ccccc1
Show InChI InChI=1S/C26H25N5O/c1-26(2,16-27)17-32-22-10-6-9-19-11-13-21(28-24(19)22)25-30-29-23-14-12-20(15-31(23)25)18-7-4-3-5-8-18/h3-15H,16-17,27H2,1-2H3
US Patent
n/an/a 0.800n/an/an/an/a7.422
Array BioPharma Inc.
US Patent
Assay Description
The assay for the determination of PIM activity is based on the incorporation of [33P] ATP into PIM2tide substrate and capture of the radiolabeled pe...
US Patent US8575145 (2013)
BindingDB Entry DOI: 10.7270/Q2M90797