BDBM104196 US8575145, 73
SMILES: COC1(COc2cccc3ccc(nc23)-c2nnc3ccccn23)CCNCC1
InChI Key: InChIKey=NNCWGHBKJIEMSS-UHFFFAOYSA-N
Data: 3 IC50
Activity Spreadsheet -- Enzyme Inhibition Constant Data from BindingDB
Found 3 hits for monomerid = 104196
Trg + Lig
Ki
nM
ΔG°
kcal/mole
IC50
nM
Kd
nM
EC50/IC50
nM
koff
s-1
kon
M-1s-1
pHTemp
°C
Serine/threonine-protein kinase pim-1
(Homo sapiens (Human))
BDBM104196
(US8575145, 73)
Show SMILES COC1(COc2cccc3ccc(nc23)-c2nnc3ccccn23)CCNCC1
Show InChI InChI=1S/C22H23N5O2/c1-28-22(10-12-23-13-11-22)15-29-18-6-4-5-16-8-9-17(24-20(16)18)21-26-25-19-7-2-3-14-27(19)21/h2-9,14,23H,10-13,15H2,1H3
US Patent
n/an/a 0.960n/an/an/an/a7.422
Array BioPharma Inc.
US Patent
Assay Description
The assay for the determination of PIM activity is based on the incorporation of [33P] ATP into PIM2tide substrate and capture of the radiolabeled pe...
US Patent US8575145 (2013)
BindingDB Entry DOI: 10.7270/Q2M90797
Serine/threonine-protein kinase PIM-3
(Rattus norvegicus (Rat))
BDBM104196
(US8575145, 73)
Show SMILES COC1(COc2cccc3ccc(nc23)-c2nnc3ccccn23)CCNCC1
Show InChI InChI=1S/C22H23N5O2/c1-28-22(10-12-23-13-11-22)15-29-18-6-4-5-16-8-9-17(24-20(16)18)21-26-25-19-7-2-3-14-27(19)21/h2-9,14,23H,10-13,15H2,1H3
US Patent
n/an/a 5n/an/an/an/a7.422
Array BioPharma Inc.
US Patent
Assay Description
The assay for the determination of PIM activity is based on the incorporation of [33P] ATP into PIM2tide substrate and capture of the radiolabeled pe...
US Patent US8575145 (2013)
BindingDB Entry DOI: 10.7270/Q2M90797
Serine/threonine-protein kinase pim-2
(Homo sapiens (Human))
BDBM104196
(US8575145, 73)
Show SMILES COC1(COc2cccc3ccc(nc23)-c2nnc3ccccn23)CCNCC1
Show InChI InChI=1S/C22H23N5O2/c1-28-22(10-12-23-13-11-22)15-29-18-6-4-5-16-8-9-17(24-20(16)18)21-26-25-19-7-2-3-14-27(19)21/h2-9,14,23H,10-13,15H2,1H3
US Patent
n/an/a 79n/an/an/an/a7.422
Array BioPharma Inc.
US Patent
Assay Description
The assay for the determination of PIM activity is based on the incorporation of [33P] ATP into PIM2tide substrate and capture of the radiolabeled pe...
US Patent US8575145 (2013)
BindingDB Entry DOI: 10.7270/Q2M90797