BDBM1044 Hydroxyethylene dipeptide isostere 36::tert-butyl N-[(2S,3S,5R)-3-hydroxy-5-{[(1S,2R)-2-hydroxy-2,3-dihydro-1H-inden-1-yl]carbamoyl}-5-[(4-methanesulfonylphenyl)methyl]-1-phenylpentan-2-yl]carbamate
SMILES: [H][C@@]1(NC(=O)[C@@H](C[C@H](O)[C@H](Cc2ccccc2)NC(=O)OC(C)(C)C)Cc2ccc(cc2)S(C)(=O)=O)[C@H](O)Cc2ccccc12
InChI Key: InChIKey=BJSDYSQDZIOQOY-QQUXCFAXSA-N
Data: 1 IC50
Activity Spreadsheet -- Enzyme Inhibition Constant Data from BindingDB
Found 1 hit for monomerid = 1044
Trg + Lig
Ki
nM
ΔG°
kcal/mole
IC50
nM
Kd
nM
EC50/IC50
nM
koff
s-1
kon
M-1s-1
pHTemp
°C
HIV-1 Protease
(Human immunodeficiency virus type 1)
BDBM1044
(Hydroxyethylene dipeptide isostere 36 | tert-butyl...)
Show SMILES [H][C@@]1(NC(=O)[C@@H](C[C@H](O)[C@H](Cc2ccccc2)NC(=O)OC(C)(C)C)Cc2ccc(cc2)S(C)(=O)=O)[C@H](O)Cc2ccccc12 |r|
Show InChI InChI=1S/C34H42N2O7S/c1-34(2,3)43-33(40)35-28(19-22-10-6-5-7-11-22)29(37)21-25(18-23-14-16-26(17-15-23)44(4,41)42)32(39)36-31-27-13-9-8-12-24(27)20-30(31)38/h5-17,25,28-31,37-38H,18-21H2,1-4H3,(H,35,40)(H,36,39)/t25-,28+,29+,30-,31+/m1/s1
n/an/a 0.170n/an/an/an/a5.530
Merck Research Laboratories
Assay Description
Assay of HIV protease inhibition was performed by peptide cleavage using the substrate Val-Ser-Gln-Asn-beta-naphthylalanine*Pro-Ile-Val. Products of ...
J Med Chem 35: 1702-9 (1992)
Article DOI: 10.1021/jm00088a004
BindingDB Entry DOI: 10.7270/Q2N877ZC