BDBM104552 US8575201, 43
SMILES: Nc1ncc(cn1)-c1ccc(cn1)C1(CCC1)c1noc(n1)-c1ccc(nc1)N1CC[C@@H](O)C1
InChI Key: InChIKey=DOLUEZAZIQUQJF-GOSISDBHSA-N
Data: 1 IC50
Activity Spreadsheet -- Enzyme Inhibition Constant Data from BindingDB
Found 1 hit for monomerid = 104552
Trg + Lig
Ki
nM
ΔG°
kcal/mole
IC50
nM
Kd
nM
EC50/IC50
nM
koff
s-1
kon
M-1s-1
pHTemp
°C
Arachidonate 5-lipoxygenase-activating protein
(Homo sapiens (Human))
BDBM104552
(US8575201, 43)
Show SMILES Nc1ncc(cn1)-c1ccc(cn1)C1(CCC1)c1noc(n1)-c1ccc(nc1)N1CC[C@@H](O)C1 |r|
Show InChI InChI=1S/C24H24N8O2/c25-23-28-11-16(12-29-23)19-4-3-17(13-26-19)24(7-1-8-24)22-30-21(34-31-22)15-2-5-20(27-10-15)32-9-6-18(33)14-32/h2-5,10-13,18,33H,1,6-9,14H2,(H2,25,28,29)/t18-/m1/s1
Reactome pathway
US Patent
n/an/a 1.20n/an/an/an/an/an/a
Boehringer Ingelheim International GmbH
US Patent
Assay Description
Compounds area assessed for the ability to bind to FLAP in a binding assay that measures compound-specific displacement of an iodinated (125I) FLAP i...
US Patent US8575201 (2013)
BindingDB Entry DOI: 10.7270/Q2ZK5FBX