null
SMILES: CS(=O)(=O)N1CCN(CC1)c1ccc(cn1)-c1nc(no1)C1(CCC1)c1ccc(nc1)-c1cnc(N)nc1
InChI Key: InChIKey=JEKRTVNMLYSPPF-UHFFFAOYSA-N
Activity Spreadsheet -- Enzyme Inhibition Constant Data from BindingDB
Found 1 hit for monomerid = 104559
Trg + Lig
Ki
nM
ΔG°
kcal/mole
IC50
nM
Kd
nM
EC50/IC50
nM
koff
s-1
kon
M-1s-1
pHTemp
°C
Arachidonate 5-lipoxygenase-activating protein
(Homo sapiens (Human))
BDBM104559
(US8575201, 50)
Show SMILES CS(=O)(=O)N1CCN(CC1)c1ccc(cn1)-c1nc(no1)C1(CCC1)c1ccc(nc1)-c1cnc(N)nc1
Show InChI InChI=1S/C25H27N9O3S/c1-38(35,36)34-11-9-33(10-12-34)21-6-3-17(13-28-21)22-31-23(32-37-22)25(7-2-8-25)19-4-5-20(27-16-19)18-14-29-24(26)30-15-18/h3-6,13-16H,2,7-12H2,1H3,(H2,26,29,30)
Reactome pathway
US Patent
n/an/a 2.70n/an/an/an/an/an/a
Boehringer Ingelheim International GmbH
US Patent
Assay Description
Compounds area assessed for the ability to bind to FLAP in a binding assay that measures compound-specific displacement of an iodinated (125I) FLAP i...
US Patent US8575201 (2013)
BindingDB Entry DOI: 10.7270/Q2ZK5FBX