BDBM104593 US8575201, 84
SMILES: Nc1ncc(cn1)-c1ccc(cn1)C1(CCC1)c1noc(n1)-c1cccnc1Cl
InChI Key: InChIKey=VMGJXFZZUOBBJZ-UHFFFAOYSA-N
Data: 1 IC50
Activity Spreadsheet -- Enzyme Inhibition Constant Data from BindingDB
Found 1 hit for monomerid = 104593
Trg + Lig
Ki
nM
ΔG°
kcal/mole
IC50
nM
Kd
nM
EC50/IC50
nM
koff
s-1
kon
M-1s-1
pHTemp
°C
5-lipoxygenase/FLAP
(Homo sapiens (Human))
BDBM104593
(US8575201, 84)
Show SMILES Nc1ncc(cn1)-c1ccc(cn1)C1(CCC1)c1noc(n1)-c1cccnc1Cl
Show InChI InChI=1S/C20H16ClN7O/c21-16-14(3-1-8-23-16)17-27-18(28-29-17)20(6-2-7-20)13-4-5-15(24-11-13)12-9-25-19(22)26-10-12/h1,3-5,8-11H,2,6-7H2,(H2,22,25,26)
Reactome pathway
US Patent
n/an/a 4.10n/an/an/an/an/an/a
Boehringer Ingelheim International GmbH
US Patent
Assay Description
Compounds area assessed for the ability to bind to FLAP in a binding assay that measures compound-specific displacement of an iodinated (125I) FLAP i...
US Patent US8575201 (2013)
BindingDB Entry DOI: 10.7270/Q2ZK5FBX