BDBM104622 US8575201, 113
SMILES: CNc1ccc(cn1)-c1nc(no1)C1(CCC1)c1ccc(nc1)-c1cnc(N)nc1
InChI Key: InChIKey=SHBRIVXUQFYHNI-UHFFFAOYSA-N
Data: 1 IC50
Activity Spreadsheet -- Enzyme Inhibition Constant Data from BindingDB
Found 1 hit for monomerid = 104622
Trg + Lig
Ki
nM
ΔG°
kcal/mole
IC50
nM
Kd
nM
EC50/IC50
nM
koff
s-1
kon
M-1s-1
pHTemp
°C
Arachidonate 5-lipoxygenase-activating protein
(Homo sapiens (Human))
BDBM104622
(US8575201, 113)
Show SMILES CNc1ccc(cn1)-c1nc(no1)C1(CCC1)c1ccc(nc1)-c1cnc(N)nc1
Show InChI InChI=1S/C21H20N8O/c1-23-17-6-3-13(9-25-17)18-28-19(29-30-18)21(7-2-8-21)15-4-5-16(24-12-15)14-10-26-20(22)27-11-14/h3-6,9-12H,2,7-8H2,1H3,(H,23,25)(H2,22,26,27)
Reactome pathway
US Patent
n/an/a 2.40n/an/an/an/an/an/a
Boehringer Ingelheim International GmbH
US Patent
Assay Description
Compounds area assessed for the ability to bind to FLAP in a binding assay that measures compound-specific displacement of an iodinated (125I) FLAP i...
US Patent US8575201 (2013)
BindingDB Entry DOI: 10.7270/Q2ZK5FBX