BDBM104819 US8569299, 8
SMILES: CN(C)[C@]1(C)C[C@H]([C@@H](C1)c1ccc(F)cc1F)C(=O)N1CCC(CC1)c1cc(C)nn1-c1ccc(Cl)c(Cl)c1
InChI Key: InChIKey=XMOICBGWKUUJPT-BBANNHEPSA-N
Data: 1 IC50
Activity Spreadsheet -- Enzyme Inhibition Constant Data from BindingDB
Found 1 hit for monomerid = 104819
Trg + Lig
Ki
nM
ΔG°
kcal/mole
IC50
nM
Kd
nM
EC50/IC50
nM
koff
s-1
kon
M-1s-1
pHTemp
°C
Prolylcarboxypeptidase (PRCP)
(Homo sapiens (Human))
BDBM104819
(US8569299, 8)
Show SMILES CN(C)[C@]1(C)C[C@H]([C@@H](C1)c1ccc(F)cc1F)C(=O)N1CCC(CC1)c1cc(C)nn1-c1ccc(Cl)c(Cl)c1 |r|
Show InChI InChI=1S/C30H34Cl2F2N4O/c1-18-13-28(38(35-18)21-6-8-25(31)26(32)15-21)19-9-11-37(12-10-19)29(39)24-17-30(2,36(3)4)16-23(24)22-7-5-20(33)14-27(22)34/h5-8,13-15,19,23-24H,9-12,16-17H2,1-4H3/t23-,24+,30-/m0/s1
Reactome pathway
US Patent
n/an/a 0.800n/an/an/an/a5.537
Merck Sharp & Dohme Corp
US Patent
Assay Description
The potency of compounds against PRCP was determined by a fluorescence intensity kinetic assay measuring the IC50 values of PRCP inhibitor test compo...
US Patent US8569299 (2013)
BindingDB Entry DOI: 10.7270/Q2K9365V