BDBM10501 1-(3-{[(4-amino-2-methylquinolin-3-yl)methoxy]methyl}phenyl)-2,2,2-trifluoroethan-1-one::4-Amino-2-methyl-3-(3-trifluoroacetylbenzyloxymethyl)quinoline::Aminoquinoline 23c
SMILES: Cc1nc2ccccc2c(N)c1COCc1cccc(c1)C(=O)C(F)(F)F
InChI Key: InChIKey=NCYVOMWFZQBIFF-UHFFFAOYSA-N
Data: 1 IC50
Activity Spreadsheet -- Enzyme Inhibition Constant Data from BindingDB
Found 1 hit for monomerid = 10501
Trg + Lig
Ki
nM
ΔG°
kcal/mole
IC50
nM
Kd
nM
EC50/IC50
nM
koff
s-1
kon
M-1s-1
pHTemp
°C
Acetylcholinesterase
(Tetronarce californica (Pacific electric ray) (Tor...)
BDBM10501
(1-(3-{[(4-amino-2-methylquinolin-3-yl)methoxy]meth...)
Show SMILES Cc1nc2ccccc2c(N)c1COCc1cccc(c1)C(=O)C(F)(F)F
Show InChI InChI=1S/C20H17F3N2O2/c1-12-16(18(24)15-7-2-3-8-17(15)25-12)11-27-10-13-5-4-6-14(9-13)19(26)20(21,22)23/h2-9H,10-11H2,1H3,(H2,24,25)
n/an/a 3n/an/an/an/a7.822
Syngenta
Assay Description
The cholinesterase assays were performed using colorimetric method reported by Ellman. Enzyme activity was determined by measuring the absorbance at ...
J Med Chem 44: 3203-15 (2001)
Article DOI: 10.1021/jm010826r
BindingDB Entry DOI: 10.7270/Q2PC30MT