BDBM105184 1-methyl-1H-1,3-benzodiazole-2-carboxylic acid (MB32-4)
SMILES: Cn1c(nc2ccccc12)C(O)=O
InChI Key: InChIKey=YHHVGKXAIOVFOH-UHFFFAOYSA-N
Data: 1 IC50
Activity Spreadsheet -- Enzyme Inhibition Constant Data from BindingDB
Found 1 hit for monomerid = 105184
Trg + Lig
Ki
nM
ΔG°
kcal/mole
IC50
nM
Kd
nM
EC50/IC50
nM
koff
s-1
kon
M-1s-1
pHTemp
°C
H1N1 Endonuclease
(2009 H1N1 Influenza)
BDBM105184
(1-methyl-1H-1,3-benzodiazole-2-carboxylic acid (MB...)
Show SMILES Cn1c(nc2ccccc12)C(O)=O
Show InChI InChI=1S/C9H8N2O2/c1-11-7-5-3-2-4-6(7)10-8(11)9(12)13/h2-5H,1H3,(H,12,13)
n/an/a 3.00E+5n/an/an/an/an/an/a
Rutgers University
ACS Chem Biol 8: 2501-8 (2013)
Article DOI: 10.1021/cb400400j
BindingDB Entry DOI: 10.7270/Q28W3BZW