BDBM105185 7-aminothieno[2,3-b]pyrazine-6-carboxylic acid (MB41-1)
SMILES: Nc1c(sc2nccnc12)C(O)=O
InChI Key: InChIKey=UJUCBOIXAMPUQL-UHFFFAOYSA-N
Data: 1 IC50
Activity Spreadsheet -- Enzyme Inhibition Constant Data from BindingDB
Found 1 hit for monomerid = 105185
Trg + Lig
Ki
nM
ΔG°
kcal/mole
IC50
nM
Kd
nM
EC50/IC50
nM
koff
s-1
kon
M-1s-1
pHTemp
°C
H1N1 Endonuclease
(2009 H1N1 Influenza)
BDBM105185
(7-aminothieno[2,3-b]pyrazine-6-carboxylic acid (MB...)
Show SMILES Nc1c(sc2nccnc12)C(O)=O
Show InChI InChI=1S/C7H5N3O2S/c8-3-4-6(10-2-1-9-4)13-5(3)7(11)12/h1-2H,8H2,(H,11,12)
n/an/a 3.00E+5n/an/an/an/an/an/a
Rutgers University
ACS Chem Biol 8: 2501-8 (2013)
Article DOI: 10.1021/cb400400j
BindingDB Entry DOI: 10.7270/Q28W3BZW