BDBM105192 3-Aminothieno[2,3-b]pyridine-2-carboxylic acid
SMILES: Nc1c(sc2ncccc12)C(O)=O
InChI Key: InChIKey=HGKGNTBBCCWIRD-UHFFFAOYSA-N
Data: 1 IC50
Activity Spreadsheet -- Enzyme Inhibition Constant Data from BindingDB
Found 1 hit for monomerid = 105192
Trg + Lig
Ki
nM
ΔG°
kcal/mole
IC50
nM
Kd
nM
EC50/IC50
nM
koff
s-1
kon
M-1s-1
pHTemp
°C
H1N1 Endonuclease
(2009 H1N1 Influenza)
BDBM105192
(3-Aminothieno[2,3-b]pyridine-2-carboxylic acid)
Show SMILES Nc1c(sc2ncccc12)C(O)=O
Show InChI InChI=1S/C8H6N2O2S/c9-5-4-2-1-3-10-7(4)13-6(5)8(11)12/h1-3H,9H2,(H,11,12)
n/an/a>1.00E+6n/an/an/an/an/an/a
Rutgers University
Assay Description
Cocktails of 4-8 compounds were used for the initial screening with single compound soaks to verify the bound fragment identity and to rule out coope...
ACS Chem Biol 8: 2501-8 (2013)
Article DOI: 10.1021/cb400400j
BindingDB Entry DOI: 10.7270/Q28W3BZW