BDBM105196 3-bromoimidazo[1,2-a]pyridine
SMILES: Brc1cnc2ccccn12
InChI Key: InChIKey=APYSHMNJHJRIDR-UHFFFAOYSA-N
Data: 1 IC50
Activity Spreadsheet -- Enzyme Inhibition Constant Data from BindingDB
Found 1 hit for monomerid = 105196
Trg + Lig
Ki
nM
ΔG°
kcal/mole
IC50
nM
Kd
nM
EC50/IC50
nM
koff
s-1
kon
M-1s-1
pHTemp
°C
H1N1 Endonuclease
(2009 H1N1 Influenza)
BDBM105196
(3-bromoimidazo[1,2-a]pyridine)
Show SMILES Brc1cnc2ccccn12
Show InChI InChI=1S/C7H5BrN2/c8-6-5-9-7-3-1-2-4-10(6)7/h1-5H
n/an/a>1.00E+6n/an/an/an/an/an/a
Rutgers University
Assay Description
Cocktails of 4-8 compounds were used for the initial screening with single compound soaks to verify the bound fragment identity and to rule out coope...
ACS Chem Biol 8: 2501-8 (2013)
Article DOI: 10.1021/cb400400j
BindingDB Entry DOI: 10.7270/Q28W3BZW