BDBM105199 5-(3-Cyanophenyl)-3-hydroxypyridin-2(1H)-one (Compound 3)
SMILES: Oc1cc(c[nH]c1=O)-c1cccc(c1)C#N
InChI Key: InChIKey=IRHCHFJUGCVFNF-UHFFFAOYSA-N
Data: 1 IC50
PDB links: 1 PDB ID matches this monomer.
Activity Spreadsheet -- Enzyme Inhibition Constant Data from BindingDB
Found 1 hit for monomerid = 105199
Trg + Lig
Ki
nM
ΔG°
kcal/mole
IC50
nM
Kd
nM
EC50/IC50
nM
koff
s-1
kon
M-1s-1
pHTemp
°C
H1N1 Endonuclease
(2009 H1N1 Influenza)
BDBM105199
(5-(3-Cyanophenyl)-3-hydroxypyridin-2(1H)-one (Comp...)
Show SMILES Oc1cc(c[nH]c1=O)-c1cccc(c1)C#N
Show InChI InChI=1S/C12H8N2O2/c13-6-8-2-1-3-9(4-8)10-5-11(15)12(16)14-7-10/h1-5,7,15H,(H,14,16)
n/an/a 730n/an/an/an/an/an/a
Rutgers University
Assay Description
Cocktails of 4-8 compounds were used for the initial screening with single compound soaks to verify the bound fragment identity and to rule out coope...
ACS Chem Biol 8: 2501-8 (2013)
Article DOI: 10.1021/cb400400j
BindingDB Entry DOI: 10.7270/Q28W3BZW
3D
3D Structure (crystal)