BDBM105356 US8575203, I-123
SMILES: Fc1ccc(Cn2cncc(C(=O)NCC#Cc3ccc4nccc(OCC5CCCNC5)c4c3)c2=O)cc1F
InChI Key: InChIKey=FBMUELALNXNVBP-UHFFFAOYSA-N
Data: 1 IC50
Activity Spreadsheet -- Enzyme Inhibition Constant Data from BindingDB
Found 1 hit for monomerid = 105356
Trg + Lig
Ki
nM
ΔG°
kcal/mole
IC50
nM
Kd
nM
EC50/IC50
nM
koff
s-1
kon
M-1s-1
pHTemp
°C
3-phosphoinositide dependent protein kinase-1
(Homo sapiens (Human))
BDBM105356
(US8575203, I-123)
Show SMILES Fc1ccc(Cn2cncc(C(=O)NCC#Cc3ccc4nccc(OCC5CCCNC5)c4c3)c2=O)cc1F
Show InChI InChI=1S/C30H27F2N5O3/c31-25-7-5-21(14-26(25)32)17-37-19-34-16-24(30(37)39)29(38)36-11-2-3-20-6-8-27-23(13-20)28(9-12-35-27)40-18-22-4-1-10-33-15-22/h5-9,12-14,16,19,22,33H,1,4,10-11,15,17-18H2,(H,36,38)
NCI pathway
Reactome pathway
US Patent
n/an/a 2n/an/an/an/an/an/a
Boehringer Ingelheim International GmbH
US Patent
Assay Description
The activity of the compounds according to the invention on the kinase PDK1 which inhibits the signal transduction pathway is determined in an in vit...
US Patent US8575203 (2013)
BindingDB Entry DOI: 10.7270/Q2HD7T91