BDBM10653 (3S)-5-[(2-CHLORO-6-FLUOROBENZYL)SULFANYL]-3-{[N-({2-ETHOXY-5-[(1E)-3-METHOXY-3-OXOPROP-1-ENYL]PHENYL}ACETYL)-D-VALYL]AMINO}-4-OXOPENTANOIC ACID::(3S)-5-{[(2-chloro-6-fluorophenyl)methyl]sulfanyl}-3-[(2S)-2-(1-{2-ethoxy-5-[(1E)-3-methoxy-3-oxoprop-1-en-1-yl]phenyl}acetamido)-3-methylbutanamido]-4-oxopentanoic acid::CINNAMIC ACID METHYL ESTER INHIBITOR::Compound 3::valine aspartyl ketone analog 14
SMILES: CCOc1ccc(\C=C\C(=O)OC)cc1CC(=O)N[C@@H](C(C)C)C(=O)N[C@@H](CC(O)=O)C(=O)CSCc1c(F)cccc1Cl
InChI Key: InChIKey=BBHZJDWNUYJWFP-FSJABKHUSA-N
Data: 5 IC50
PDB links: 1 PDB ID matches this monomer.
Activity Spreadsheet -- Enzyme Inhibition Constant Data from BindingDB
Found 5 hits for monomerid = 10653
Trg + Lig
Ki
nM
ΔG°
kcal/mole
IC50
nM
Kd
nM
EC50/IC50
nM
koff
s-1
kon
M-1s-1
pHTemp
°C
Caspase-3
(Homo sapiens (Human))
BDBM10653
((3S)-5-[(2-CHLORO-6-FLUOROBENZYL)SULFANYL]-3-{[N-(...)
Show SMILES CCOc1ccc(\C=C\C(=O)OC)cc1CC(=O)N[C@@H](C(C)C)C(=O)N[C@@H](CC(O)=O)C(=O)CSCc1c(F)cccc1Cl |r|
Show InChI InChI=1S/C31H36ClFN2O8S/c1-5-43-26-11-9-19(10-12-29(40)42-4)13-20(26)14-27(37)35-30(18(2)3)31(41)34-24(15-28(38)39)25(36)17-44-16-21-22(32)7-6-8-23(21)33/h6-13,18,24,30H,5,14-17H2,1-4H3,(H,34,41)(H,35,37)(H,38,39)/b12-10+/t24-,30-/m0/s1
NCI pathway
Reactome pathway
n/an/a 7.95n/an/an/an/a7.037
Merck Research Laboratories
Assay Description
The substrate peptides terminating in AMC are processed by caspases with or without inhibitors, and the accumulation of AMC was assessed with a Cytof...
J Med Chem 47: 2466-74 (2004)
Article DOI: 10.1021/jm0305523
BindingDB Entry DOI: 10.7270/Q24F1NZ4
3D
3D Structure (crystal)
Caspase-3
(Homo sapiens (Human))
BDBM10653
((3S)-5-[(2-CHLORO-6-FLUOROBENZYL)SULFANYL]-3-{[N-(...)
Show SMILES CCOc1ccc(\C=C\C(=O)OC)cc1CC(=O)N[C@@H](C(C)C)C(=O)N[C@@H](CC(O)=O)C(=O)CSCc1c(F)cccc1Cl |r|
Show InChI InChI=1S/C31H36ClFN2O8S/c1-5-43-26-11-9-19(10-12-29(40)42-4)13-20(26)14-27(37)35-30(18(2)3)31(41)34-24(15-28(38)39)25(36)17-44-16-21-22(32)7-6-8-23(21)33/h6-13,18,24,30H,5,14-17H2,1-4H3,(H,34,41)(H,35,37)(H,38,39)/b12-10+/t24-,30-/m0/s1
NCI pathway
Reactome pathway
n/an/a 8n/an/an/an/a7.037
Merck Frosst Canada & Co.
Assay Description
The substrate peptides terminating in AMC are processed by caspases with or without inhibitors, and the accumulation of AMC was assessed with a Cytof...
Bioorg Med Chem Lett 14: 805-8 (2004)
Article DOI: 10.1016/j.bmcl.2003.10.064
BindingDB Entry DOI: 10.7270/Q20P0X88
3D
3D Structure (crystal)
Caspase-8
(Homo sapiens (Human))
BDBM10653
((3S)-5-[(2-CHLORO-6-FLUOROBENZYL)SULFANYL]-3-{[N-(...)
Show SMILES CCOc1ccc(\C=C\C(=O)OC)cc1CC(=O)N[C@@H](C(C)C)C(=O)N[C@@H](CC(O)=O)C(=O)CSCc1c(F)cccc1Cl |r|
Show InChI InChI=1S/C31H36ClFN2O8S/c1-5-43-26-11-9-19(10-12-29(40)42-4)13-20(26)14-27(37)35-30(18(2)3)31(41)34-24(15-28(38)39)25(36)17-44-16-21-22(32)7-6-8-23(21)33/h6-13,18,24,30H,5,14-17H2,1-4H3,(H,34,41)(H,35,37)(H,38,39)/b12-10+/t24-,30-/m0/s1
NCI pathway
Reactome pathway
n/an/a 3.85E+3n/an/an/an/an/an/a
Merck Frosst Canada & Co.
Assay Description
The substrate peptides terminating in AMC are processed by caspases with or without inhibitors, and the accumulation of AMC was assessed with a Cytof...
Bioorg Med Chem Lett 14: 805-8 (2004)
Article DOI: 10.1016/j.bmcl.2003.10.064
BindingDB Entry DOI: 10.7270/Q20P0X88
Caspase-7
(Homo sapiens (Human))
BDBM10653
((3S)-5-[(2-CHLORO-6-FLUOROBENZYL)SULFANYL]-3-{[N-(...)
Show SMILES CCOc1ccc(\C=C\C(=O)OC)cc1CC(=O)N[C@@H](C(C)C)C(=O)N[C@@H](CC(O)=O)C(=O)CSCc1c(F)cccc1Cl |r|
Show InChI InChI=1S/C31H36ClFN2O8S/c1-5-43-26-11-9-19(10-12-29(40)42-4)13-20(26)14-27(37)35-30(18(2)3)31(41)34-24(15-28(38)39)25(36)17-44-16-21-22(32)7-6-8-23(21)33/h6-13,18,24,30H,5,14-17H2,1-4H3,(H,34,41)(H,35,37)(H,38,39)/b12-10+/t24-,30-/m0/s1
NCI pathway
Reactome pathway
n/an/a 24n/an/an/an/an/an/a
Merck Frosst Canada & Co.
Assay Description
The substrate peptides terminating in AMC are processed by caspases with or without inhibitors, and the accumulation of AMC was assessed with a Cytof...
Bioorg Med Chem Lett 14: 805-8 (2004)
Article DOI: 10.1016/j.bmcl.2003.10.064
BindingDB Entry DOI: 10.7270/Q20P0X88
Caspase-1
(Homo sapiens (Human))
BDBM10653
((3S)-5-[(2-CHLORO-6-FLUOROBENZYL)SULFANYL]-3-{[N-(...)
Show SMILES CCOc1ccc(\C=C\C(=O)OC)cc1CC(=O)N[C@@H](C(C)C)C(=O)N[C@@H](CC(O)=O)C(=O)CSCc1c(F)cccc1Cl |r|
Show InChI InChI=1S/C31H36ClFN2O8S/c1-5-43-26-11-9-19(10-12-29(40)42-4)13-20(26)14-27(37)35-30(18(2)3)31(41)34-24(15-28(38)39)25(36)17-44-16-21-22(32)7-6-8-23(21)33/h6-13,18,24,30H,5,14-17H2,1-4H3,(H,34,41)(H,35,37)(H,38,39)/b12-10+/t24-,30-/m0/s1
NCI pathway
Reactome pathway
n/an/a 1.80E+3n/an/an/an/an/an/a
Merck Frosst Canada & Co.
Assay Description
The substrate peptides terminating in AMC are processed by caspases with or without inhibitors, and the accumulation of AMC was assessed with a Cytof...
Bioorg Med Chem Lett 14: 805-8 (2004)
Article DOI: 10.1016/j.bmcl.2003.10.064
BindingDB Entry DOI: 10.7270/Q20P0X88