BDBM10667 US8846719, 284
SMILES: Cc1onc(C2CCCCN2)c1COc1ccc(cn1)C(=O)NCCO
InChI Key: InChIKey=AEGIKRBMUJASTE-UHFFFAOYSA-N
Data: 1 KI
Activity Spreadsheet -- Enzyme Inhibition Constant Data from BindingDB
Found 1 hit for monomerid = 10667
Trg + Lig
Ki
nM
ΔG°
kcal/mole
IC50
nM
Kd
nM
EC50/IC50
nM
koff
s-1
kon
M-1s-1
pHTemp
°C
Gamma-aminobutyric acid receptor subunit alpha-5 (GABA(A))
(Homo sapiens (Human))
BDBM10667
(US8846719, 284)
Show SMILES Cc1onc(C2CCCCN2)c1COc1ccc(cn1)C(=O)NCCO
Show InChI InChI=1S/C18H24N4O4/c1-12-14(17(22-26-12)15-4-2-3-7-19-15)11-25-16-6-5-13(10-21-16)18(24)20-8-9-23/h5-6,10,15,19,23H,2-4,7-9,11H2,1H3,(H,20,24)
Reactome pathway
US Patent
0.5 -11.8n/an/an/an/an/a7.54
Roche Palo Alto LLC
US Patent
Assay Description
Radioligand binding assays were carried out in a volume of 200 mL (96-well plates) which contained 100 mL of cell memebranes, [3H]flumazenil at a con...
US Patent US8846719 (2014)
BindingDB Entry DOI: 10.7270/Q2V986RV